11.7801842,-60.9609871,15.0000000
11.8084390,-60.7629742,15.0000000
11.8350183,-60.5647178,15.0000000
11.8598600,-60.3663257,15.0000000
11.8829472,-60.1675630,15.0000000
11.9042087,-59.9686790,15.0000000
11.9236036,-59.7697400,15.0000000
11.9411362,-59.5703479,15.0000000
11.9567382,-59.3709545,15.0000000
11.9703896,-59.1715994,15.0000000
11.9821091,-58.9717293,15.0000000
11.9918481,-58.7719634,15.0000000
11.9996070,-58.5723659,15.0000000
12.0054135,-58.3722041,15.0000000
12.0092523,-58.1722143,15.0000000
12.0111459,-57.9724362,15.0000000
12.0111206,-57.7723153,15.0000000
12.0092031,-57.5722621,15.0000000
12.0054685,-57.3724339,15.0000000
12.0000779,-57.1725656,15.0000000
11.9933360,-56.9726041,15.0000000
11.9856397,-56.7729332,15.0000000
11.9772784,-56.5731447,15.0000000
11.9683762,-56.3735333,15.0000000
11.9587882,-56.1739251,15.0000000
11.9483515,-55.9740483,15.0000000
11.9369601,-55.7743667,15.0000000
11.9244783,-55.5749941,14.9926732
11.9107359,-55.3753475,14.8735048
11.8956285,-55.1757422,14.7612457
11.8790849,-54.9766962,14.6548366
11.8609368,-54.7774162,14.5537018
11.8411131,-54.5782155,14.4573127
11.8195799,-54.3795841,14.3649220
11.7961863,-54.1808493,14.2763054
11.7708943,-53.9823568,14.1912056
11.7436615,-53.7843057,14.1093015
11.7143748,-53.5863685,14.0306598
11.6830062,-53.3888248,13.9552381
11.6494820,-53.1916301,13.8832956
11.6137357,-52.9948170,13.8149985
11.5757076,-52.7984557,13.7500268
11.5353150,-52.6024951,13.6905418
11.4925183,-52.4072142,13.6359627
11.4471926,-52.2123870,13.5811643
11.3993979,-52.0181830,13.5301880
11.3492323,-51.8246592,13.4863378
11.2967577,-51.6316316,13.4511484
11.2421153,-51.4392420,13.4236434
11.1854182,-51.2475119,13.4037408
11.1267284,-51.0562873,13.3913653
11.0661875,-50.8656770,13.3863228
11.0039040,-50.6756707,13.3884603
10.9399499,-50.4861495,13.3976391
10.8744607,-50.2971836,13.4137034
10.8075414,-50.1087467,13.4365218
10.7392719,-49.9207444,13.4614977
10.6697797,-49.7332136,13.4862274
10.5991673,-49.5461194,13.5107142
10.5275185,-49.3593847,13.5349607
10.4549431,-49.1730247,13.5589699
10.3815097,-48.9870130,13.5827446
10.3072544,-48.8013036,13.6062876
10.2322302,-48.6159155,13.6296015
10.1564746,-48.4308330,13.6526891
10.0800175,-48.2460227,13.6755530
10.0029062,-48.0614929,13.6981958
9.9251774,-47.8772265,13.7206200
9.8468642,-47.6931984,13.7428282
9.7680097,-47.5094067,13.7648229
9.6886500,-47.3258333,13.7866065
9.6088215,-47.1424604,13.8081815
9.5285633,-46.9592772,13.8295501
9.4479111,-46.7762649,13.8507147
9.3669041,-46.5934125,13.8716777
9.2855778,-46.4107007,13.8924412
9.2039679,-46.2281108,13.9130076
9.1221160,-46.0456376,13.9333791
9.0400546,-45.8632548,13.9535577
8.9578190,-45.6809433,13.9735457
8.8754539,-45.4987038,13.9933452
8.7929883,-45.3165033,14.0129582
8.7104579,-45.1343226,14.0323868
8.6279098,-44.9521683,14.0516330
8.5453707,-44.7700016,14.0706989
8.4628755,-44.5878024,14.0895863
8.3804741,-44.4055830,14.1082973
8.2981886,-44.2232915,14.1268336
8.2160571,-44.0409354,14.1451973
8.1340948,-43.8585027,14.1633902
8.0523166,-43.6759910,14.1814141
7.9707356,-43.4933955,14.1992708
7.8893602,-43.3106981,14.2169621
7.8082099,-43.1279060,14.2344898
7.7272988,-42.9450152,14.2518555
7.6466324,-42.7620005,14.2690612
7.5662335,-42.5788771,14.2861083
7.4861162,-42.3956398,14.3029986
7.4062830,-42.2122567,14.3197338
7.3267606,-42.0287517,14.3363154
7.2475623,-41.8451179,14.3527451
7.1686881,-41.6613170,14.3690244
7.0901682,-41.4773815,14.3851550
7.0120153,-41.2933030,14.4011383
6.9342268,-41.1090368,14.4169759
6.8568363,-40.9246241,14.4326693
6.7798557,-40.7400549,14.4482200
6.7032799,-40.5552784,14.4636294
6.6271457,-40.3703440,14.4788991
6.5514644,-40.1852412,14.4940303
6.4762287,-39.9999122,14.5090246
6.4014777,-39.8144147,14.5238833
6.3272227,-39.6287382,14.5386079
6.2534539,-39.4428180,14.5531996
6.1802126,-39.2567191,14.5676598
6.1075106,-39.0704323,14.5819899
6.0353353,-38.8838856,14.5961911
5.9637300,-38.6971506,14.6102648
5.8927072,-38.5102207,14.6242122
5.8222518,-38.3230160,14.6380346
5.7524085,-38.1356140,14.6517332
5.6831907,-37.9480112,14.6653093
5.6145818,-37.7601214,14.6787642
5.5466267,-37.5720254,14.6920989
5.4793384,-37.3837186,14.7053147
5.4127049,-37.1951251,14.7184128
5.3467652,-37.0063125,14.7313943
5.2815274,-36.8172807,14.7442604
5.2169665,-36.6279737,14.7570122
5.1530700,-36.4384634,14.7696509
5.0897906,-36.2487644,14.7821775
5.0270742,-36.0588610,14.7945931
4.9649123,-35.8687841,14.8068989
4.9032886,-35.6785110,14.8190958
4.8422084,-35.4880775,14.8311851
4.7816618,-35.2974757,14.8431676
4.7216372,-35.1066910,14.8550444
4.6621382,-34.9157562,14.8668167
4.6031567,-34.7246669,14.8784853
4.5446793,-34.5334010,14.8900512
4.4867102,-34.3419934,14.9015155
4.4292434,-34.1504460,14.9128792
4.3722635,-33.9587281,14.9241431
4.3157749,-33.7668750,14.9353083
4.2597739,-33.5748965,14.9463758
4.2042433,-33.3827539,14.9573463
4.1491869,-33.1904816,14.9682209
4.0946035,-32.9980973,14.9790005
4.0404743,-32.8055556,14.9896859
3.9868025,-32.6128894,15.0000000
3.9335888,-32.4201231,15.0000000
3.8808132,-32.2272066,15.0000000
3.8284782,-32.0341709,15.0000000
3.7765858,-31.8410453,15.0000000
3.7251156,-31.6477769,15.0000000
3.6740694,-31.4543953,15.0000000
3.6234494,-31.2609322,15.0000000
3.5732355,-31.0673340,15.0000000
3.5234290,-30.8736292,15.0000000
3.4740318,-30.6798492,15.0000000
3.4250243,-30.4859425,15.0000000
3.3764075,-30.2919364,15.0000000
3.3281821,-30.0978598,15.0000000
3.2803301,-29.9036650,15.0000000
3.2328516,-29.7093785,15.0000000
3.1857463,-29.5150247,15.0000000
3.1389974,-29.3205618,15.0000000
3.0926047,-29.1260150,15.0000000
3.0465662,-28.9314029,15.0000000
3.0008671,-28.7366912,15.0000000
2.9555064,-28.5419032,15.0000000
2.9104803,-28.3470513,15.0000000
2.8657764,-28.1521095,15.0000000
2.8213926,-27.9570985,15.0000000
2.7773239,-27.7620247,15.0000000
2.7335659,-27.5668697,15.0000000
2.6901247,-27.3716480,15.0000000
2.6470036,-27.1763593,15.0000000
2.6042038,-26.9809934,15.0000000
2.5617305,-26.7855599,15.0000000
2.5195862,-26.5900548,15.0000000
2.4777742,-26.3944774,15.0000000
2.4362983,-26.1988300,15.0000000
2.3951608,-26.0031076,15.0000000
2.3543669,-25.8073183,15.0000000
2.3139186,-25.6114554,15.0000000
2.2738187,-25.4155152,14.9418796
2.2340739,-25.2195138,14.7481027
2.1946845,-25.0234339,14.5528688
2.1556541,-24.8272758,14.3561042
2.1169910,-24.6310619,14.1577304
2.0786933,-24.4347641,13.9576646
2.0407661,-24.2383881,13.7558183
2.0032188,-24.0419615,13.5520967
1.9660477,-23.8454452,13.3463992
1.9292596,-23.6488515,13.1386177
1.8928644,-23.4522117,12.9286350
1.8568575,-23.2554769,12.7163263
1.8212467,-23.0586658,12.5015563
1.7860426,-22.8618121,12.2841772
1.7512398,-22.6648596,12.0640306
1.7168474,-22.4678314,11.8409427
1.6828762,-22.2707631,11.6147230
1.6493208,-22.0735941,11.3851644
1.6161906,-21.8763494,11.1520386
1.5834969,-21.6790658,10.9150924
1.5512349,-21.4816822,10.6740470
1.5194138,-21.2842221,10.4285934
1.4880450,-21.0867227,10.1783832
1.4571249,-20.8891268,9.9230244
1.4266640,-20.6914531,9.6632122
1.3966950,-20.4937334,9.4002207
1.3672871,-20.2959089,9.1380308
1.3386036,-20.0979796,8.8769756
1.3108367,-19.8999245,8.6164092
1.2841852,-19.7017050,8.3552007
1.2588632,-19.5034082,8.0927119
1.2350699,-19.3049811,7.8214260
1.2127758,-19.1062345,7.5395334
1.1916890,-18.9076826,7.2276685
1.1716262,-18.7084815,6.9100694
1.1531047,-18.5093481,6.6157466
1.1372870,-18.3102792,6.3481976
1.1255171,-18.1102989,6.1060461
1.1193657,-17.9106750,5.8885314
1.1203130,-17.7108836,5.6942310
1.1299616,-17.5104391,5.5217173
1.1496967,-17.3124513,5.3789930
1.1814327,-17.1147575,5.2555944
1.2262889,-16.9199283,5.1456654
1.2853275,-16.7285238,5.0334654
1.3588189,-16.5421456,4.9217784
1.4473024,-16.3614848,4.8095421
1.5496589,-16.1897520,4.6808545
1.6673275,-16.0260688,4.5489355
1.7999730,-15.8732142,4.4197341
1.9428601,-15.7379084,4.3286666
2.1021526,-15.6171195,4.3114098
2.2725081,-15.5161985,4.2940836
2.4372934,-15.4166834,4.5178753
2.6095181,-15.3150723,4.7294209
2.7949573,-15.2272472,4.7883538
2.9804166,-15.1561963,4.9031811
3.1720190,-15.0961183,5.0656809
3.3677867,-15.0447637,5.2512130
3.5622720,-15.0001191,5.4289961
3.7587614,-14.9577713,5.5997794
3.9544543,-14.9148026,5.3219893
4.1503041,-14.8673238,5.0189150
4.3404806,-14.8136515,4.7582402
4.5328796,-14.7481448,4.5270685
4.7181110,-14.6702715,4.3205561
4.8936996,-14.5784020,4.1283438
5.0596919,-14.4708337,3.9459110
5.2158411,-14.3474460,3.7365056
5.3558474,-14.2047343,3.7216096
5.4710407,-14.0415719,3.7066537
5.5618119,-13.8633853,3.7972639
5.6311920,-13.6761121,3.9711945
5.6831686,-13.4839677,4.1947147
5.7208132,-13.2879360,4.4243012
5.7451987,-13.0885502,4.6408380
5.7566318,-12.8892531,4.8378977
5.7556957,-12.6900723,5.0104439
5.7426665,-12.4897949,5.1653989
5.7179312,-12.2907421,5.3055495
5.6821885,-12.0946169,5.4338648
5.6355258,-11.8995074,5.5567735
5.5789158,-11.7076738,5.6752350
5.5129607,-11.5189228,5.7944827
5.4382706,-11.3329319,5.9197982
5.3561674,-11.1507685,6.0526472
5.2673013,-10.9714110,6.2016637
5.1729570,-10.7950288,6.3460286
5.0740909,-10.6209678,6.4860617
4.9717908,-10.4491627,6.6220465
4.8664784,-10.2788552,6.7542361
4.7586449,-10.1101296,6.8828576
4.6489096,-9.9435413,7.0081154
4.5364075,-9.7775378,7.1301949
4.4225153,-9.6135568,7.2492642
4.3070880,-9.4504136,7.3654769
4.1906160,-9.2876278,7.4789735
4.0737288,-9.1255363,7.5898832
3.9562545,-8.9637078,7.6983246
3.8382469,-8.8021251,7.8044077
3.7199497,-8.6410424,7.9082341
3.6011813,-8.4801312,8.0098980
3.4820358,-8.3194311,8.1094874
3.3626823,-8.1590766,8.2070841
3.2430223,-7.9988387,8.3027646
3.1231339,-7.8387217,8.3966004
3.0031446,-7.6787927,8.4886588
2.8830260,-7.5189077,8.5790029
2.7628411,-7.3590425,8.6676919
2.6426803,-7.1992076,8.7547820
2.5225594,-7.0393128,8.8403258
2.4025561,-6.8793491,8.9243734
2.2827119,-6.7192599,9.0069720
2.1630606,-6.5589750,9.0881664
2.0437289,-6.3985501,9.1679990
1.9246769,-6.2378341,9.2465104
1.8059442,-6.0768396,9.3237389
1.6875970,-5.9156757,9.3997210
1.5695469,-5.7542336,9.4744916
1.4517924,-5.5925218,9.5480840
1.3344086,-5.4306562,9.6205299
1.2173064,-5.2685268,9.6918597
1.1004833,-5.1061415,9.7621025
0.9840124,-4.9436148,9.8312859
0.8678094,-4.7808413,9.8994368
0.7518713,-4.6178293,9.9665806
0.6362619,-4.4546808,10.0327418
0.5209079,-4.2913053,10.0979441
0.4058047,-4.1277083,10.1622101
0.2910076,-3.9639811,10.2255615
0.1764521,-3.8000447,10.2880194
0.0621330,-3.6359039,10.3496039
-0.0519020,-3.4716400,10.4103345
-0.1657102,-3.3071832,10.4702299
-0.2792962,-3.1425394,10.5293082
-0.3926200,-2.9777795,10.5875870
-0.5057325,-2.8128426,10.6450831
-0.6186371,-2.6477360,10.7018128
-0.7313016,-2.4825200,10.7577920
-0.8437703,-2.3171425,10.8130357
-0.9560451,-2.1516136,10.8675589
-1.0681032,-1.9859798,10.9213759
-1.1799806,-1.8202009,10.9745004
-1.2916778,-1.6542891,11.0269459
-1.4031828,-1.4882753,11.0787255
-1.5145214,-1.3221340,11.1298517
-1.6256946,-1.1558771,11.1803369
-1.7366994,-0.9895218,11.2301929
-1.8475526,-0.8230564,11.2794312
-1.9582556,-0.6564918,11.3280632
-2.0688138,-0.4898330,11.3760996
-2.1792350,-0.3230816,11.4235512
-2.2895223,-0.1562461,11.4704283
-2.3996877,0.0106784,11.5167408
-2.5097309,0.1776780,11.5624985
-2.6196574,0.3447479,11.6077110
-2.7294843,0.5119006,11.6523875
-2.8392039,0.6791109,11.6965371
-2.9488249,0.8463789,11.7401685
-3.0583659,1.0137209,11.7832903
-3.1678114,1.1811060,11.8259108
-3.2771725,1.3485446,11.8680383
-3.3864618,1.5160492,11.9096807
-3.4956655,1.6835920,11.9508456
-3.6047947,1.8511833,11.9915408
-3.7138598,2.0188325,12.0317735
-3.8228492,2.1865150,12.0715510
-3.9317736,2.3542407,12.1108804
-4.0406419,2.5220165,12.1497686
-4.1494441,2.6898206,12.1882222
-4.2581908,2.8576624,12.2262479
-4.3668896,3.0255471,12.2638521
-4.4755320,3.1934549,12.3010411
-4.5841282,3.3613949,12.3378210
-4.6926847,3.5293706,12.3741979
-4.8011946,3.6973645,12.4101777
-4.9096674,3.8653848,12.4457661
-5.0181090,4.0334338,12.4809688
-5.1265135,4.2014960,12.5157913
-5.2348901,4.3695788,12.5502390
-5.3432439,4.5376837,12.5843172
-5.4515703,4.7057967,12.6180312
-5.5598777,4.8739244,12.6513860
-5.6681710,5.0420674,12.6843865
-5.7764464,5.2102137,12.7170378
-5.8847119,5.3783688,12.7493445
-5.9929717,5.5465326,12.7813114
-6.1012234,5.7146947,12.8129431
-6.2094739,5.8828596,12.8442442
-6.3177274,6.0510267,12.8752189
-6.4259823,6.2191873,12.9058718
-6.5342451,6.3873445,12.9362070
-6.6425193,6.5554976,12.9662288
-6.7508046,6.7236391,12.9959413
-6.8591066,6.8917712,13.0253484
-6.9674286,7.0598928,13.0544543
-7.0757712,7.2279979,13.0832626
-7.1841394,7.3960876,13.1117774
-7.2925362,7.5641602,13.1400023
-7.4009632,7.7322114,13.1679411
-7.5094246,7.9002412,13.1955973
-7.6179231,8.0682475,13.2229745
-7.7264613,8.2362273,13.2500763
-7.8350428,8.4041798,13.2769059
-7.9436700,8.5721021,13.3034670
-8.0523464,8.7399931,13.3297626
-8.1610748,8.9078508,13.3557963
-8.2698574,9.0756717,13.3815710
-8.3786988,9.2434563,13.4070900
-8.4876011,9.4112015,13.4323565
-8.5965660,9.5789033,13.4573734
-8.7055990,9.7465638,13.4821438
-8.8147019,9.9141790,13.5066706
-8.9238758,10.0817440,13.5309568
-9.0331273,10.2492627,13.5550052
-9.1424575,10.4167300,13.5788185
-9.2518670,10.5841405,13.6023997
-9.3613637,10.7514996,13.6257514
-9.4709478,10.9188011,13.6488764
-9.5806196,11.0860390,13.6717772
-9.6903880,11.2532206,13.6944565
-9.8002526,11.4203384,13.7169168
-9.9102131,11.5873857,13.7391607
-10.0202798,11.7543715,13.7611906
-10.1304513,11.9212874,13.7830090
-10.2407272,12.0881260,13.8046184
-10.3511186,12.2548979,13.8260210
-10.4616234,12.4215934,13.8472193
-10.5722409,12.5882049,13.8682156
-10.6829834,12.7547445,13.8890120
-10.7938479,12.9212012,13.9096110
-10.9048333,13.0875670,13.9300146
-11.0159532,13.2538558,13.9502251
-11.1272035,13.4200548,13.9702445
-11.2385831,13.5861563,13.9900751
-11.3501066,13.7521755,14.0097189
-11.4617686,13.9180979,14.0291780
-11.5735685,14.0839162,14.0484543
-11.6855218,14.2496469,14.0675499
-11.7976215,14.4152733,14.0864668
-11.9098678,14.5807893,14.1052069
-12.0222769,14.7462123,14.1237720
-12.1348400,14.9115233,14.1421642
-12.2475582,15.0767175,14.1603853
-12.3604499,15.2418145,14.1784371
-12.4735027,15.4067908,14.1963214
-12.5867208,15.5716538,14.2140400
-12.7001011,15.7364142,14.2315947
-12.8136249,15.9010671,14.2489872
-12.9272899,16.0656290,14.2662192
-13.0410800,16.2300973,14.2832925
-13.1549906,16.3944856,14.3002087
-13.2690149,16.5588049,14.1681133
-13.3831278,16.7230396,13.9494537
-13.4973387,16.8872239,13.7280394
-13.6116344,17.0513598,13.5037764
-13.7259819,17.2154208,13.2765637
-13.8404052,17.3794627,13.0462863
-13.9548829,17.5434763,12.8128225
-14.0693750,17.7074259,12.5760379
-14.1839200,17.8713884,12.3357728
-14.2984881,18.0353439,12.0918860
-14.4130322,18.1992471,11.8445038
-14.5276034,18.3631939,11.5947237
-14.6421676,18.5271609,11.3420549
-14.7566679,18.6910858,11.0863398
-14.8711649,18.8550810,10.8282442
-14.9855882,19.0190858,10.5638420
-15.0999768,19.1830885,10.2961083
-15.2144389,19.3470804,10.0300463
-15.3290465,19.5109371,9.7645337
-15.4439475,19.6746480,9.4987135
-15.5592009,19.8380834,9.2318987
-15.6748824,20.0011496,8.9597041
-15.7911207,20.1639436,8.6789708
-15.9077343,20.3264127,8.3854026
-16.0243955,20.4887584,8.0765426
-16.1408461,20.6514379,7.7771800
-16.2565161,20.8145680,7.4874083
-16.3709282,20.9785026,7.2129681
-16.4835707,21.1438764,6.9555754
-16.5934685,21.3109044,6.7178028
-16.6997752,21.4802010,6.5056079
-16.8014838,21.6525493,6.3218424
-16.8970092,21.8280329,6.1692035
-16.9851060,22.0073967,6.0461802
-17.0645044,22.1913699,5.9534676
-17.1330656,22.3784422,5.8972274
-17.1897829,22.5697124,5.8535685
-17.2339158,22.7651493,5.8123155
-17.2653589,22.9620279,5.7543734
-17.2854135,23.1624303,5.6518109
-17.2942835,23.3627380,5.5149043
-17.2920232,23.5634529,5.3597002
-17.2783956,23.7629628,5.1945496
-17.2530373,23.9625299,5.0210084
-17.2155045,24.1571612,4.8707959
-17.1628880,24.3514963,4.7575965
-17.0935411,24.5408826,4.6737100
-17.0072456,24.7205190,4.6200988
-16.9037551,24.8893647,4.5747937
-16.7829919,25.0475784,4.5565557
-16.6453142,25.1911249,4.5382444
-16.4972451,25.3201809,4.6059216
-16.3374525,25.4409795,4.8120878
-16.1679055,25.5447928,4.8131962
-15.9877989,25.6321970,4.8120071
-15.7970063,25.7054584,4.8938626
-15.6044196,25.7626887,4.9891633
-15.4082119,25.8044972,5.0621999
-15.2101481,25.8289755,5.0739156
-15.0104963,25.8351010,5.0539474
-14.8118905,25.8233517,5.0519643
-14.6136894,25.7952166,5.0918348
-14.4184758,25.7528117,5.1706849
-14.2263048,25.6982738,5.2881760
-14.0369645,25.6338140,5.4453916
-13.8504045,25.5617868,5.6155490
-13.6660506,25.4843465,5.7793939
-13.4831058,25.4033856,5.9374593
-13.3011158,25.3204326,6.0902048
-13.1196490,25.2365035,6.2380310
-12.9382543,25.1521109,6.3812890
-12.7569454,25.0677594,6.5202889
-12.5755555,24.9836238,6.6553061
-12.3939937,24.8996591,6.7865870
-12.2124322,24.8158503,6.9143526
-12.0308575,24.7320684,7.0388025
-11.8492703,24.6481896,7.1601173
-11.6678060,24.5641533,7.2784615
-11.4864720,24.4798339,7.3939853
-11.3053120,24.3951219,7.5068261
-11.1243804,24.3099582,7.6171105
-10.9436539,24.2242955,7.7249548
-10.7631725,24.1381612,7.8304668
-10.5828992,24.0515380,7.9337461
-10.4028627,23.9644366,8.0348856
-10.2230721,23.8768621,8.1339714
-10.0434997,23.7888006,8.2310840
-9.8641672,23.7002620,8.3262986
-9.6850811,23.6112490,8.4196858
-9.5062213,23.5217515,8.5113116
-9.3276062,23.4317779,8.6012381
-9.1492381,23.3413292,8.6895239
-8.9711040,23.2503982,8.7762242
-8.7932188,23.1589923,8.8613909
-8.6155822,23.0671108,8.9450734
-8.4381868,22.9747497,9.0273182
-8.2610441,22.8819143,9.1081697
-8.0841521,22.7886035,9.1876697
-7.9075086,22.6948157,9.2658581
-7.7311206,22.6005542,9.3427729
-7.5549862,22.5058179,9.4184502
-7.3791075,22.4106075,9.4929244
-7.2034863,22.3149238,9.5662284
-7.0281223,22.2187664,9.6383936
-6.8530211,22.1221381,9.7094501
-6.6781785,22.0250364,9.7794265
-6.5035976,21.9274629,9.8483504
-6.3292862,21.8294218,9.9162482
-6.1552338,21.7309071,9.9831451
-5.9814483,21.6319231,10.0490654
-5.8079387,21.5324750,10.1140325
-5.6346881,21.4325528,10.1780687
-5.4617097,21.3321645,10.2411957
-5.2890136,21.2313156,10.3034343
-5.1165758,21.1299923,10.3648044
-4.9444162,21.0282064,10.4253252
-4.7725446,20.9259638,10.4850156
-4.6009305,20.8232464,10.5438932
-4.4296007,20.7200704,10.6019756
-4.2585644,20.6164416,10.6592793
-4.0877845,20.5123378,10.7158207
-3.9172950,20.4077797,10.7716153
-3.7471042,20.3027730,10.8266783
-3.5771688,20.1972912,10.8810244
-3.4075297,20.0913599,10.9346676
-3.2381939,19.9849841,10.9876218
-3.0691129,19.8781336,11.0399004
-2.9003336,19.7708383,11.0915161
-2.7318619,19.6631028,11.1424816
-2.5636449,19.5548935,11.1928090
-2.3957344,19.4462443,11.2425101
-2.2281352,19.3371590,11.2915964
-2.0607914,19.2276016,11.3400791
-1.8937581,19.1176089,11.3879689
-1.7270394,19.0071843,11.4352765
-1.5605776,18.8962903,11.4820120
-1.3944294,18.7849650,11.5281855
-1.2285987,18.6732122,11.5738066
-1.0630272,18.5609932,11.6188848
-0.8977715,18.4483469,11.6634293
-0.7328357,18.3352771,11.7074490
-0.5681627,18.2217455,11.7509527
-0.4038065,18.1077900,11.7939490
-0.2397722,17.9934150,11.8364460
-0.0760052,17.8785834,11.8784519
0.0874447,17.7633306,11.9199747
0.2505712,17.6476623,11.9610220
0.4134249,17.5315434,12.0016013
0.5759620,17.4150056,12.0417200
0.7381746,17.2980559,12.0813853
0.9001079,17.1806623,12.1206042
1.0617258,17.0628518,12.1593835
1.2230183,16.9446325,12.1977300
1.3840246,16.8259766,12.2356502
1.5447166,16.7069053,12.2731504
1.7050828,16.5874281,12.3102369
1.8651553,16.4675217,12.3469160
2.0249146,16.3472011,12.3831935
2.1843477,16.2264770,12.4190752
2.3434796,16.1053310,12.4545671
2.5022989,15.9837722,12.4896746
2.6607916,15.8618117,12.5244033
2.8189758,15.7394358,12.5587585
2.9768471,15.6166486,12.5927456
3.1343909,15.4934609,12.6263696
3.2916197,15.3698634,12.6596357
3.4485271,15.2458627,12.6925489
3.6051077,15.1214519,12.7251139
3.7613570,14.9966124,12.7573356
3.9172444,14.8713372,12.7892186
4.0727694,14.7455964,12.8207676
4.2279111,14.6193773,12.8519869
4.3826370,14.4926755,12.8828811
4.5369540,14.3654550,12.9134545
4.6908409,14.2377025,12.9437113
4.8442564,14.1094216,12.9736557
4.9972137,13.9805704,13.0032918
5.1496935,13.8511354,13.0326235
5.3016485,13.7211316,13.0616549
5.4531067,13.5905229,13.0903899
5.6040657,13.4593118,13.1188321
5.7544891,13.3275423,13.1469855
5.9044241,13.1951891,13.1748535
6.0538773,13.0622625,13.2024399
6.2028112,12.9288126,13.2297482
6.3512748,12.7948124,13.2567819
6.4992757,12.6602713,13.2835444
6.6467784,12.5252385,13.3100390
6.7938280,12.3896895,13.3362692
6.9404347,12.2536314,13.3622380
7.0865652,12.1171122,13.3879488
7.2322611,11.9801101,13.4134047
7.3775345,11.8426304,13.4386087
7.5223545,11.7047194,13.4635640
7.6667594,11.5663581,13.4882734
7.8107631,11.4275500,13.5127401
7.9543370,11.2883402,13.5369667
8.0975166,11.1487116,13.5609563
8.2403169,11.0086671,13.5847116
8.3827117,10.8682496,13.6082354
8.5247343,10.7274444,13.6315304
8.6664001,10.5862536,13.6545993
8.8076855,10.4447185,13.6774447
8.9486218,10.3028259,13.7000693
9.0892246,10.1605777,13.7224754
9.2294729,10.0180136,13.7446658
9.3693962,9.8751216,13.7666429
9.5090101,9.7319039,13.7884090
9.6482959,9.5883982,13.8099667
9.7872819,9.4445938,13.8313182
9.9259831,9.3004934,13.8524660
10.0643833,9.1561326,13.8734123
10.2025098,9.0115017,13.8941594
10.3403768,8.8666043,13.9147095
10.4779705,8.7214738,13.9350648
10.6153173,8.5761015,13.9552275
10.7524303,8.4304920,13.9751998
10.8892986,8.2846763,13.9949836
11.0259472,8.1386467,14.0145812
11.1623884,7.9924091,14.0339946
11.2986139,7.8459917,14.0532258
11.4346475,7.6993882,14.0722767
11.5705004,7.5526057,14.0911493
11.7061672,7.4056694,14.1098457
11.8416701,7.2585746,14.1283676
11.9770194,7.1113295,14.1467170
12.1122128,6.9639561,14.1648958
12.2472705,6.8164518,14.1829057
12.3822019,6.6688257,14.2007486
12.5170079,6.5210963,14.2184262
12.6517065,6.3732636,14.2359403
12.7863063,6.2253374,14.2532928
12.9208118,6.0773323,14.2704851
13.0552378,5.9292514,14.2875191
13.1895927,5.7811051,14.3043965
13.3238844,5.6329039,14.3211188
13.4581247,5.4846545,14.3376877
13.5923213,5.3363674,14.3541049
13.7264863,5.1880489,14.3703718
13.8606273,5.0397097,14.3864900
13.9947524,4.8913602,14.4024612
14.1288768,4.7430027,14.4182867
14.2630046,4.5946519,14.4339682
14.3971443,4.4463174,14.4495071
14.5313138,4.2979986,14.4649048
14.6655138,4.1497134,14.4801629
14.7997532,4.0014708,14.4952827
14.9340523,3.8532675,14.5102657
15.0684088,3.7051244,14.5251132
15.2028321,3.5570498,14.5398266
15.3373438,3.4090384,14.5544073
15.4719401,3.2611131,14.5688567
15.6066298,3.1132817,14.5831760
15.7414402,2.9655324,14.5973665
15.8763634,2.8179051,14.6114297
16.0114202,2.6704171,14.6253666
16.1466587,2.5230604,14.6391787
16.2820711,2.3758874,14.6528671
16.4176864,2.2289097,14.6664331
16.5535449,2.0821274,14.6798779
16.6896432,1.9355879,14.6932027
16.8260092,1.7893041,14.7064086
16.9626796,1.6432805,14.7194970
17.0996548,1.4975598,14.7324689
17.2369619,1.3521567,14.7453254
17.3746337,1.2070800,14.7580678
17.5126764,1.0623697,14.7706971
17.6511210,0.9180468,14.7832144
17.7900052,0.7741339,14.7956209
17.9293489,0.6306755,14.8079175
18.0691877,0.4877003,14.8201055
18.2095559,0.3452388,14.8321858
18.3504785,0.2033308,14.8441595
18.4919895,0.0620068,14.8560276
18.6341157,-0.0786951,14.8677912
18.7768886,-0.2187419,14.8794512
18.9203400,-0.3581006,14.8910087
19.0644869,-0.4967242,14.9024646
19.2093694,-0.6345879,14.9138199
19.3550165,-0.7716564,14.9250756
19.5014327,-0.9078714,14.9362326
19.6486692,-1.0432191,14.9472919
19.7967513,-1.1776609,14.9552949
19.9456676,-1.3111260,14.9597711
20.0954843,-1.4436138,14.9608045
20.2462206,-1.5750816,14.9584896
20.3978469,-1.7054451,14.9529230
20.5504476,-1.8347196,14.9441992
20.7040330,-1.9628560,14.9324242
20.8585539,-2.0897582,14.9177052
21.0141167,-2.2154587,14.9001480
21.1707167,-2.3398992,14.8798749
21.3282871,-2.4629748,14.8570043
21.4869610,-2.5847377,14.8316142
21.6467064,-2.7051134,14.8039369
21.8074456,-2.8239971,14.7742393
21.9693506,-2.9414579,14.7334475
22.1323186,-3.0574227,14.6470147
22.2962687,-3.1719442,14.5522817
22.4611990,-3.2851680,14.4468655
22.6269315,-3.3971238,14.3306128
22.7934864,-3.5079644,14.2043301
22.9606680,-3.6176981,14.0678715
23.1285270,-3.7264973,13.9212165
23.2970044,-3.8344627,13.7641975
23.4657881,-3.9415396,13.5965196
23.6351662,-4.0480604,13.4179196
23.8049128,-4.1540392,13.2278199
23.9746770,-4.2594260,13.0256606
24.1448711,-4.3646553,12.8109201
24.3151869,-4.4697279,12.5828031
24.4852535,-4.5746211,12.3520683
24.6553880,-4.6797717,12.1342490
24.8253813,-4.7853766,11.9416175
24.9946579,-4.8916162,11.7795540
25.1631521,-4.9991273,11.6509914
25.3306583,-5.1085226,11.5563256
25.4963646,-5.2200184,11.4918790
25.6604576,-5.3344051,11.4460652
25.8221280,-5.4514119,11.4000672
25.9820479,-5.5710665,11.3838620
26.1408866,-5.6934087,11.3903893
26.2976211,-5.8172830,11.4131584
26.4530288,-5.9429493,11.4504884
26.6076232,-6.0705666,11.4970406
26.7605093,-6.1991876,11.5430340
26.9124772,-6.3293076,11.5884781
27.0635400,-6.4608225,11.6333823
27.2132808,-6.5932742,11.6777557
27.3621906,-6.7270240,11.7216072
27.5099608,-6.8617365,11.7649455
27.6569870,-6.9977216,11.8077790
27.8028639,-7.1345477,11.8501160
27.9477696,-7.2723081,11.8919644
28.0921259,-7.4113164,11.9333322
28.2351809,-7.5507245,11.9742270
28.3776702,-7.6910742,12.0146562
28.5198221,-7.8323552,12.0546272
28.6609230,-7.9736085,12.0941470
28.8017552,-8.1152414,12.1332227
28.9427602,-8.2571935,12.1718609
29.0833705,-8.3989891,11.9974536
29.2237287,-8.5413790,11.8214459
29.3632038,-8.6846346,11.6800804
29.5012937,-8.8291669,11.5732373
29.6376387,-8.9755332,11.4977956
29.7716996,-9.1240018,11.4457293
29.9030121,-9.2746699,11.3996115
30.0316324,-9.4278542,11.3541655
30.1574754,-9.5835247,11.3085368
30.2801953,-9.7412282,11.2654091
30.4000857,-9.9013008,11.2253505
30.5170957,-10.0636415,11.1885414
30.6310431,-10.2279358,11.1550832
30.7420538,-10.3942838,11.1254958
30.8501481,-10.5626303,11.1000329
30.9552653,-10.7327735,11.0787401
31.0574769,-10.9046989,11.0619872
31.1568257,-11.0783075,11.0509380
31.2533719,-11.2534468,11.0470949
31.3473100,-11.4300930,11.0535652
31.4387229,-11.6079577,11.0715244
31.5278094,-11.7869390,11.1009144
31.6148294,-11.9670518,11.1420606
31.6998841,-12.1480200,11.1923932
31.7831835,-12.3298162,11.2420995
31.8648925,-12.5123417,11.2911909
31.9451583,-12.6954843,11.3396785
32.0241639,-12.8792350,11.3875733
32.1020140,-13.0634221,11.4348856
32.1788597,-13.2480006,11.4816259
32.2548854,-13.4330245,11.5278040
32.3301712,-13.6183095,11.5734296
32.4048237,-13.8037448,11.6185123
32.4790568,-13.9894996,11.6630612
32.5529439,-14.1754017,11.7070852
32.6265321,-14.3612177,11.7505932
32.7000772,-14.5472468,11.7935936
32.7736469,-14.7333175,11.8360948
32.8472440,-14.9190974,11.8781048
32.9211598,-15.1049862,11.9196315
32.9954489,-15.2907769,11.9606827
33.0701025,-15.4761375,12.0012659
33.1453471,-15.6615762,12.0413884
33.2210265,-15.8467550,12.0810575
33.2971260,-16.0316914,12.1202800
33.3737005,-16.2165466,12.1590630
33.4506735,-16.4011489,12.1974130
33.5281020,-16.5856440,12.2353367
33.6059099,-16.7698588,12.2728404
33.6841730,-16.9539832,12.3099304
33.7628685,-17.1379823,12.3466127
33.8418434,-17.3215353,12.3828935
33.9213393,-17.5052548,12.4187786
34.0011602,-17.6887638,12.4542737
34.0811300,-17.8717670,12.4893843
34.1615651,-18.0551268,12.5241161
34.2421506,-18.2383034,12.5584745
34.3226865,-18.4210608,12.5924645
34.4033840,-18.6041504,12.6260916
34.4839769,-18.7873407,12.6593607
34.5640965,-18.9703862,12.6922767
34.6435470,-19.1537487,12.7248446
34.7219152,-19.3376883,12.7570691
34.7987023,-19.5219752,12.7889550
34.8742598,-19.7073340,12.8205067
34.9485915,-19.8927527,12.8517288
35.0221568,-20.0785068,12.8826257
35.0954037,-20.2648765,12.9132017
35.1683585,-20.4511024,12.9434611
35.2412575,-20.6370656,12.9734081
35.3146052,-20.8234071,13.0030467
35.3883296,-21.0093676,13.0323810
35.4626055,-21.1948898,13.0614148
35.5378148,-21.3804801,13.0901522
35.6138343,-21.5654308,13.1185969
35.6909098,-21.7499814,13.1467526
35.7692101,-21.9341925,13.1746230
35.8487112,-22.1176831,13.2022118
35.9296457,-22.3006739,13.2295224
36.0120198,-22.4828624,13.2493260
36.0960992,-22.6645067,13.2597690
36.1818797,-22.8452416,13.2600647
36.2694365,-23.0248837,13.2503005
36.3591875,-23.2039071,13.2305330
36.4509513,-23.3814548,13.1958842
36.5450361,-23.5578098,13.1515924
36.6415097,-23.7330943,13.1090193
36.7401162,-23.9069942,13.0731332
36.8408593,-24.0797126,13.0445870
36.9436713,-24.2513123,13.0228974
37.0483538,-24.4216547,13.0083148
37.1548774,-24.5908927,13.0009298
37.2631440,-24.7590695,13.0007423
37.3730017,-24.9261534,13.0077339
37.4843839,-25.0922488,13.0218624
37.5971823,-25.2573980,13.0430535
37.7112856,-25.4216340,13.0708399
37.8266190,-25.5850227,13.0994812
37.9430946,-25.7475848,13.1278310
38.0606566,-25.9093760,13.1558930
38.1792376,-26.0704333,13.1836710
38.2987504,-26.2307670,13.2111684
38.4191602,-26.3904576,13.2383889
38.5403944,-26.5495340,13.2653358
38.6623638,-26.7080035,13.2920126
38.7850458,-26.8659592,13.3184227
38.9083664,-27.0234262,13.3445692
39.0322392,-27.1804140,13.3704555
39.1566455,-27.3370167,13.3960848
39.2815125,-27.4932589,13.4214601
39.4067606,-27.6491568,13.4465845
39.5323682,-27.8047976,13.4714612
39.6582648,-27.9602073,13.4960930
39.7843800,-28.1154114,13.5204829
39.9106842,-28.2704856,13.5446337
40.0371110,-28.4254597,13.5685484
40.1635974,-28.5803677,13.5922297
40.2901050,-28.7352734,13.6156803
40.4165714,-28.8902113,13.6389030
40.5429380,-29.0452207,13.6619004
40.6691592,-29.2003569,13.6846752
40.7951760,-29.3556586,13.7072299
40.9209293,-29.5111653,13.7295670
41.0463714,-29.6669301,13.7516892
41.1714438,-29.8229935,13.7735988
41.2960819,-29.9793882,13.7952983
41.4202449,-30.1361765,13.8167900
41.5438685,-30.2933926,13.8380764
41.6668936,-30.4510673,13.8591598
41.7893180,-30.6092182,13.8800424
41.9111429,-30.7678282,13.9007265
42.0323725,-30.9268798,13.9212143
42.1530315,-31.0863830,13.9415080
42.2731183,-31.2463140,13.9616098
42.3926378,-31.4066562,13.9815218
42.5116149,-31.5674212,14.0012462
42.6300456,-31.7285814,14.0207849
42.7479394,-31.8901271,14.0401400
42.8653164,-32.0520642,14.0593135
42.9821743,-32.2143674,14.0783074
43.0985262,-32.3770333,14.0971237
43.2143843,-32.5400574,14.1157643
43.3297524,-32.7034233,14.1342311
43.4446448,-32.8671300,14.1525259
43.5590644,-33.0311604,14.1706507
43.6730258,-33.1955137,14.1886072
43.7865401,-33.3601849,14.2063973
43.8996020,-33.5251446,14.2240226
44.0122401,-33.6904131,14.2414851
44.1244587,-33.8559748,14.2587863
44.2362458,-34.0217898,14.2759281
44.3476464,-34.1879024,14.2929120
44.4586546,-34.3542814,14.3097398
44.5692544,-34.5208791,14.3264131
44.6795069,-34.6877636,14.3429335
44.7893956,-34.8548862,14.3593026
44.8989027,-35.0221941,14.3755220
45.0081023,-35.1897751,14.3915932
45.1169704,-35.3575660,14.4075178
45.2254882,-35.5255102,14.4232973
45.3337381,-35.6937074,14.4389332
45.4416940,-35.8620881,14.4544270
45.5493367,-36.0305923,14.4697801
45.6567498,-36.1993204,14.4849939
45.7639123,-36.3682082,14.5000700
45.8708046,-36.5371923,14.5150097
45.9775040,-36.7063621,14.5298143
46.0840011,-36.8756692,14.5444853
46.1902775,-37.0450503,14.5590241
46.2963966,-37.2145722,14.5734318
46.4023580,-37.3842002,14.5877100
46.5081486,-37.5538791,14.6018598
46.6138032,-37.7236816,14.6158826
46.7192497,-37.8936012,14.6297797
46.8244485,-38.0636950,14.6435522
46.9293415,-38.2339830,14.6572015
47.0338684,-38.4044647,14.6707287
47.1380325,-38.5751946,14.6841352
47.2418185,-38.7461724,14.6974220
47.3451877,-38.9173483,14.7105904
47.4481730,-39.0887918,14.7236415
47.5507652,-39.2605024,14.7365765
47.6529092,-39.4324029,14.7493966
47.7546510,-39.6045859,14.7621028
47.8559832,-39.7770551,14.7746963
47.9568370,-39.9497087,14.7871782
48.0572683,-40.1226579,14.7995496
48.1572702,-40.2959076,14.8118115
48.2567685,-40.4693446,14.8239651
48.3558213,-40.6430858,14.8360113
48.4544215,-40.8171352,14.8479512
48.5524991,-40.9913848,14.8597859
48.6501059,-41.1659420,14.8715164
48.7472361,-41.3408128,14.8831437
48.8438255,-41.5158969,14.8946687
48.9399197,-41.6912918,14.9060924
49.0355130,-41.8670033,14.9174159
49.1305480,-42.0429409,14.9286401
49.2250642,-42.2191924,14.9397659
49.3190548,-42.3957610,14.9507943
49.4124707,-42.5725690,14.9617262
49.5053445,-42.7496929,14.9725625
49.5976681,-42.9271326,14.9833042
49.6894012,-43.1048252,14.9939521
49.7805693,-43.2828346,15.0000000
49.8711623,-43.4611565,15.0000000
49.9611501,-43.6397461,15.0000000
50.0505494,-43.8186514,15.0000000
50.1393487,-43.9978646,15.0000000
50.2275290,-44.1773619,15.0000000
50.3150966,-44.3571712,15.0000000
50.4020394,-44.5372831,15.0000000
50.4883496,-44.7176966,15.0000000
50.5740215,-44.8984154,15.0000000
50.6590451,-45.0794340,15.0000000
50.7434202,-45.2607624,15.0000000
50.8271474,-45.4423866,15.0000000
50.9102357,-45.6243027,15.0000000
50.9926953,-45.8065102,15.0000000
51.0745308,-45.9889953,15.0000000
51.1557504,-46.1717530,15.0000000
51.2363652,-46.3547845,15.0000000
51.3163794,-46.5380752,15.0000000
51.3958017,-46.7216211,15.0000000
51.4746432,-46.9054237,15.0000000
51.5529079,-47.0894680,15.0000000
51.6306049,-47.2737508,15.0000000
51.7077455,-47.4582741,15.0000000
51.7843334,-47.6430221,15.0000000
51.8603782,-47.8279929,15.0000000
51.9358910,-48.0131884,15.0000000
52.0108757,-48.1985927,15.0000000
52.0853423,-48.3842046,15.0000000
52.1593016,-48.5700261,15.0000000
52.2327578,-48.7560410,15.0000000
52.3057209,-48.9422492,15.0000000
52.3782020,-49.1286523,15.0000000
52.4502050,-49.3152342,15.0000000
52.5217405,-49.5019957,15.0000000
52.5928194,-49.6889381,15.0000000
52.6634456,-49.8760452,15.0000000
52.7336302,-50.0633188,15.0000000
52.8033837,-50.2507597,15.0000000
52.8727104,-50.4383519,15.0000000
52.9416217,-50.6260981,15.0000000
53.0101277,-50.8139985,15.0000000
53.0782330,-51.0020373,15.0000000
53.1459491,-51.1902181,15.0000000
53.2132862,-51.3785405,15.0000000
53.2802490,-51.5669890,15.0000000
53.3468492,-51.7555678,15.0000000
53.4130968,-51.9442761,15.0000000
53.4789967,-52.1330988,15.0000000
53.5445608,-52.3220406,15.0000000
53.6097989,-52.5111000,15.0000000
53.6747164,-52.7002628,15.0000000
53.7393250,-52.8895337,15.0000000
53.8036339,-53.0789093,15.0000000
53.8676495,-53.2683773,15.0000000
53.9313877,-53.4579431,15.0000000
53.9948647,-53.6475968,15.0000000
54.0580982,-53.8373322,15.0000000
54.1211058,-54.0271426,15.0000000
54.1839052,-54.2170222,15.0000000
54.2465140,-54.4069645,15.0000000
54.3089501,-54.5969638,15.0000000
54.3712311,-54.7870141,15.0000000
54.4333747,-54.9771091,15.0000000
54.4953988,-55.1672433,15.0000000
54.5573212,-55.3574108,15.0000000
54.6191594,-55.5476055,15.0000000
54.6809314,-55.7378217,15.0000000
54.7426550,-55.9280539,15.0000000
54.8043478,-56.1182957,15.0000000
54.8660269,-56.3085421,15.0000000
54.9277064,-56.4987887,15.0000000
54.9893935,-56.6890322,15.0000000
55.0510908,-56.8792727,15.0000000
55.1127992,-57.0695098,15.0000000
55.1745191,-57.2597427,15.0000000
55.2362513,-57.4499719,15.0000000
55.2979963,-57.6401971,15.0000000
55.3597545,-57.8304176,15.0000000
55.4215268,-58.0206338,15.0000000
55.4833137,-58.2108454,15.0000000
55.5451156,-58.4010517,15.0000000
55.6069333,-58.5912531,15.0000000
55.6687675,-58.7814493,15.0000000
55.7306184,-58.9716397,15.0000000
55.7924869,-59.1618246,15.0000000
55.8543736,-59.3520037,15.0000000
55.9162789,-59.5421764,15.0000000
55.9782036,-59.7323430,15.0000000
56.0401482,-59.9225033,15.0000000
56.1021131,-60.1126566,15.0000000
56.1640992,-60.3028032,15.0000000
56.2261070,-60.4929428,15.0000000
56.2881370,-60.6830749,15.0000000
56.3501899,-60.8731998,15.0000000
56.4122663,-61.0633170,15.0000000
56.4743666,-61.2534262,15.0000000
56.5364916,-61.4435274,15.0000000
56.5986418,-61.6336206,15.0000000
56.6608178,-61.8237050,15.0000000
56.7230202,-62.0137809,15.0000000
56.7852496,-62.2038481,15.0000000
56.8475066,-62.3939061,15.0000000
56.9097918,-62.5839549,15.0000000
56.9721058,-62.7739944,15.0000000
57.0344490,-62.9640240,15.0000000
57.0968223,-63.1540440,15.0000000
57.1592262,-63.3440540,15.0000000
57.2216611,-63.5340535,15.0000000
57.2841278,-63.7240428,15.0000000
57.3466268,-63.9140215,15.0000000
57.4091587,-64.1039892,15.0000000
57.4717241,-64.2939459,15.0000000
57.5343236,-64.4838915,15.0000000
57.5969578,-64.6738255,15.0000000
57.6596273,-64.8637480,15.0000000
57.7223327,-65.0536586,15.0000000
57.7850745,-65.2435571,15.0000000
57.8478534,-65.4334435,15.0000000
57.9106699,-65.6233173,15.0000000
57.9735246,-65.8131785,15.0000000
58.0364182,-66.0030269,15.0000000
58.0993512,-66.1928622,15.0000000
58.1623242,-66.3826842,15.0000000
58.2253378,-66.5724927,15.0000000
58.2883926,-66.7622876,15.0000000
58.3514892,-66.9520686,15.0000000
58.4146281,-67.1418355,15.0000000
58.4778100,-67.3315880,15.0000000
58.5410355,-67.5213261,15.0000000
58.6043051,-67.7110495,15.0000000
58.6676194,-67.9007579,15.0000000
58.7309791,-68.0904513,15.0000000
58.7943846,-68.2801292,15.0000000
58.8578367,-68.4697916,15.0000000
58.9213359,-68.6594383,15.0000000
58.9848827,-68.8490689,15.0000000
59.0484778,-69.0386834,15.0000000
59.1121219,-69.2282816,15.0000000
59.1758153,-69.4178630,15.0000000
59.2395588,-69.6074276,15.0000000
59.3033529,-69.7969754,15.0000000
59.3671982,-69.9865057,15.0000000
59.4310954,-70.1760186,15.0000000
59.4950450,-70.3655140,15.0000000
59.5590475,-70.5549913,15.0000000
59.6231036,-70.7444505,15.0000000
59.6872139,-70.9338916,15.0000000
59.7513789,-71.1233139,15.0000000
59.8155992,-71.3127174,15.0000000
59.8798756,-71.5021023,15.0000000
59.9442084,-71.6914676,15.0000000
60.0085983,-71.8808136,15.0000000
60.0730460,-72.0701403,15.0000000
60.1375519,-72.2594467,15.0000000
60.2021166,-72.4487331,15.0000000
60.2667409,-72.6379996,15.0000000
60.3314251,-72.8272452,15.0000000
60.3961700,-73.0164700,15.0000000
60.4609762,-73.2056744,15.0000000
60.5258441,-73.3948570,15.0000000
60.5907743,-73.5840183,15.0000000
60.6557677,-73.7731585,15.0000000
60.7208245,-73.9622762,15.0000000
60.7859454,-74.1513719,15.0000000
60.8511313,-74.3404459,15.0000000
60.9163822,-74.5294967,15.0000000
60.9816991,-74.7185248,15.0000000
61.0470827,-74.9075306,15.0000000
61.1125331,-75.0965123,15.0000000
61.1780512,-75.2854708,15.0000000
61.2436377,-75.4744063,15.0000000
61.3092928,-75.6633170,15.0000000
61.3750174,-75.8522037,15.0000000
61.4408122,-76.0410668,15.0000000
61.5066772,-76.2299044,15.0000000
61.5726135,-76.4187173,15.0000000
61.6386217,-76.6075060,15.0000000
61.7047020,-76.7962683,15.0000000
61.7708552,-76.9850053,15.0000000
61.8370822,-77.1737175,15.0000000
61.9033828,-77.3624024,15.0000000
61.9697582,-77.5510614,15.0000000
62.0362091,-77.7396948,15.0000000
62.1027354,-77.9283002,15.0000000
62.1693382,-78.1168791,15.0000000
62.2360183,-78.3054317,15.0000000
62.3027754,-78.4939555,15.0000000
62.3696108,-78.6824520,15.0000000
62.4365253,-78.8709217,15.0000000
62.5035185,-79.0593616,15.0000000
62.5705917,-79.2477736,15.0000000
62.6377458,-79.4361582,15.0000000
62.7049802,-79.6245120,15.0000000
62.7722964,-79.8128373,15.0000000
62.8396952,-80.0011346,15.0000000
62.9071761,-80.1894002,15.0000000
62.9747404,-80.3776366,15.0000000
63.0423892,-80.5658444,15.0000000
63.1101216,-80.7540195,15.0000000
63.1779393,-80.9421647,15.0000000
63.2458432,-81.1302807,15.0000000
63.3138323,-81.3183631,15.0000000
63.3819085,-81.5064150,15.0000000
63.4500726,-81.6944370,15.0000000
63.5183236,-81.8824244,15.0000000
63.5866634,-82.0703806,15.0000000
63.6550929,-82.2583064,15.0000000
63.7236109,-82.4461964,15.0000000
63.7922194,-82.6340547,15.0000000
63.8609194,-82.8218819,15.0000000
63.9297095,-83.0096723,15.0000000
63.9985918,-83.1974305,15.0000000
64.0675674,-83.3851568,15.0000000
64.1366346,-83.5728452,15.0000000
64.2057959,-83.7605008,15.0000000
64.2750521,-83.9481240,15.0000000
64.3444015,-84.1357081,15.0000000
64.4138468,-84.3232588,15.0000000
64.4833888,-84.5107765,15.0000000
64.5530254,-84.6982539,15.0000000
64.6227597,-84.8856974,15.0000000
64.6925924,-85.0731072,15.0000000
64.7625214,-85.2604756,15.0000000
64.8325497,-85.4478094,15.0000000
64.9026782,-85.6351090,15.0000000
64.9729043,-85.8223658,15.0000000
65.0432322,-86.0095885,15.0000000
65.1136609,-86.1967746,15.0000000
65.1841873,-86.3839223,15.0000000
65.2548056,-86.5710360,15.0000000
65.3255079,-86.7581149,15.0000000
65.3962901,-86.9451685,15.0000000
65.4671433,-87.1321932,15.0000000
65.5380598,-87.3191888,15.0000000
65.6090379,-87.5061707,15.0000000
65.6800660,-87.6931287,15.0000000
65.7511370,-87.8800636,15.0000000
65.8222509,-88.0669962,15.0000000
65.8933940,-88.2539102,15.0000000
65.9645593,-88.4408072,15.0000000
66.0357489,-88.6277133,15.0000000
66.1069468,-88.8146060,15.0000000
66.1781462,-89.0014882,15.0000000
66.2493512,-89.1883906,15.0000000
66.3205433,-89.3752852,15.0000000
66.3917162,-89.5621757,15.0000000
66.4628757,-89.7490974,15.0000000
66.5340011,-89.9360170,15.0000000
66.6050865,-90.1229391,15.0000000
66.6761391,-90.3099034,15.0000000
66.7471364,-90.4968714,15.0000000
66.8180724,-90.6838483,15.0000000
66.8889563,-90.8708786,15.0000000
66.9597633,-91.0579186,15.0000000
67.0304877,-91.2449737,15.0000000
67.1011400,-91.4320934,15.0000000
67.1716939,-91.6192290,15.0000000
67.2421433,-91.8063857,15.0000000
67.3125007,-91.9936182,15.0000000
67.3827379,-92.1808732,15.0000000
67.4528482,-92.3681548,14.8540322
67.5228462,-92.5555236,14.6434291
67.5927020,-92.7429216,14.4317167
67.6624083,-92.9303514,14.2188037
67.7319817,-93.1178801,14.0045749
67.8013906,-93.3054442,13.7889551
67.8706278,-93.4930480,13.5718560
67.9397095,-93.6807579,13.3529558
68.0086067,-93.8685133,13.1325372
68.0773059,-94.0563110,12.9106771
68.1458162,-94.2441966,12.6849323
68.2141469,-94.4321100,12.4542098
68.2824182,-94.6201322,12.2151267
68.3506876,-94.8080632,11.9774869
68.4190974,-94.9959748,11.7411242
68.4877370,-95.1838843,11.5031438
68.5565391,-95.3716079,11.2600802
68.6253933,-95.5593462,11.0134782
68.6940674,-95.7472681,10.7806345
68.7621521,-95.9352330,10.5618734
68.8293879,-96.1235529,10.3565935
68.8954706,-96.3124324,10.1642104
68.9599420,-96.5016333,9.9845098
69.0225586,-96.6915412,9.8171737
69.0830002,-96.8823455,9.6618822
69.1407615,-97.0736395,9.5188682
69.1956217,-97.2659461,9.3880479
69.2472103,-97.4593436,9.2694279
69.2950079,-97.6533134,9.1637259
69.3387814,-97.8484864,9.0709330
69.3780891,-98.0446883,8.9915239
69.4124500,-98.2414525,8.9273848
69.4415638,-98.4394444,8.8753321
69.4649977,-98.6380204,8.8284764
69.4825773,-98.8372400,8.7840361
69.4941705,-99.0371353,8.7425435
69.4996296,-99.2370645,8.7028135
69.4988577,-99.4372351,8.6650957
69.4917657,-99.6369971,8.6294747
69.4782318,-99.8369702,8.5940584
69.4582724,-100.0358746,8.5597971
69.4317927,-100.2341715,8.5293225
69.3986921,-100.4320021,8.5192546
69.3592808,-100.6275406,8.5068990
69.3132384,-100.8224438,8.4727126
69.2606855,-101.0161510,8.4432703
69.2022382,-101.2069804,8.4212576
69.1380968,-101.3953192,8.4095769
69.0677484,-101.5836321,8.4144458
68.9927428,-101.7691436,8.4413962
68.9136730,-101.9523294,8.4946734
68.8309365,-102.1335986,8.5664515
68.7446782,-102.3132776,8.6442494
68.6545606,-102.4923683,8.7291826
68.5617658,-102.6676172,8.7991098
68.4639461,-102.8411131,8.7970695
68.3604085,-103.0132489,8.7873976
68.2520466,-103.1827713,8.7869485
68.1407513,-103.3475232,8.7994461
68.0246764,-103.5113056,8.8396781
67.9057064,-103.6725144,8.9060318
67.7845512,-103.8314515,8.9889449
67.6610978,-103.9895514,9.0704441
67.5368354,-104.1462112,9.1505724
67.4117907,-104.3027549,9.2293708
67.2871688,-104.4590179,9.3068779
67.1628334,-104.6165408,9.3831308
67.0404810,-104.7745069,9.2281661
66.9199424,-104.9344513,9.0832531
66.8018438,-105.0968464,8.9633822
66.6881305,-105.2601353,8.8683331
66.5773224,-105.4275041,8.7836503
66.4706825,-105.5978630,8.7056003
66.3694716,-105.7695814,8.6272543
66.2730582,-105.9431027,8.5412937
66.1799820,-106.1199866,8.4664364
66.0920772,-106.2990397,8.4112755
66.0097975,-106.4807115,8.3587175
65.9332543,-106.6651765,8.3094214
65.8625789,-106.8526454,8.2677213
65.7983025,-107.0425338,8.2323300
65.7411066,-107.2332488,8.1995107
65.6905104,-107.4267399,8.1665596
65.6467341,-107.6227202,8.1343493
65.6102428,-107.8189844,8.1042446
65.5807133,-108.0166873,8.0792178
65.5580792,-108.2159608,8.0603155
65.5424042,-108.4151715,8.0469556
65.5334574,-108.6150325,8.0409728
65.5311019,-108.8152940,8.0425054
65.5351565,-109.0152104,8.0506554
65.5454112,-109.2151078,8.0672636
65.5616014,-109.4143286,8.0918182
65.5835409,-109.6134565,8.1239020
65.6108977,-109.8116341,8.1640320
65.6433250,-110.0086644,8.2129685
65.6806025,-110.2054956,8.2740544
65.7220609,-110.4009943,8.3502217
65.7673031,-110.5955631,8.4407814
65.8160427,-110.7897355,8.5320134
65.8677171,-110.9828478,8.6215599
65.9220002,-111.1751461,8.7094786
65.9786543,-111.3670636,8.7958238
66.0372242,-111.5582305,8.8806470
66.0974402,-111.7488782,8.9639969
66.1590166,-111.9391444,9.0459195
66.2216243,-112.1290144,9.1264584
66.2850157,-112.3187174,9.2056552
66.3488500,-112.5082054,9.2835492
66.4128239,-112.6975577,9.3601780
66.4767223,-112.8871400,9.4355773
66.5401487,-113.0768111,9.5097812
66.6027305,-113.2665340,9.5828222
66.6642927,-113.4569346,9.6547314
66.7243470,-113.6477327,9.7255386
66.7824422,-113.8387886,9.7952720
66.8384165,-114.0310636,9.8639591
66.8916327,-114.2238139,9.9149004
66.9418518,-114.4173733,9.7983320
66.9888335,-114.6120572,9.6922736
67.0321202,-114.8072437,9.5964786
67.0715237,-115.0034456,9.5106068
67.1066784,-115.2003154,9.4350209
67.1373496,-115.3981369,9.3676651
67.1632163,-115.5965333,9.3086509
67.1840244,-115.7953075,9.2574209
67.1996121,-115.9951098,9.2116455
67.2097027,-116.1947335,9.1712106
67.2141827,-116.3946011,9.1342053
67.2129187,-116.5951319,9.0977906
67.2058613,-116.7947569,9.0612296
67.1930106,-116.9940357,9.0257235
67.1743179,-117.1938923,8.9946142
67.1500904,-117.3923569,8.9718985
67.1206259,-117.5894239,8.9607938
67.0860351,-117.7866077,8.9662336
67.0468552,-117.9829474,8.9882394
67.0038675,-118.1776001,9.0364657
66.9570646,-118.3714067,9.0877291
66.9059226,-118.5650126,9.1218467
66.8504976,-118.7568043,9.1364962
66.7906058,-118.9469927,9.1456424
66.7258215,-119.1362175,9.1440494
66.6558845,-119.3244895,9.1341884
66.5815356,-119.5095118,9.1188278
66.5021106,-119.6928229,9.1006240
66.4173793,-119.8747242,9.0819591
66.3281369,-120.0534807,9.0635677
66.2340557,-120.2298517,9.0471207
66.1349519,-120.4041856,9.0333375
66.0316303,-120.5751550,9.0216627
65.9236423,-120.7436332,9.0133588
65.8112229,-120.9093211,9.0080646
65.6947131,-121.0718278,9.0051088
65.5739947,-121.2314376,9.0058121
65.4493793,-121.3878386,9.0091091
65.3207402,-121.5412833,9.0148397
65.1886146,-121.6912568,9.0240036
65.0527401,-121.8381501,9.0351855
64.9134243,-121.9816779,9.0466562
64.7710789,-122.1217514,9.0677334
64.6255195,-122.2590930,9.1051856
64.4775076,-122.3935815,9.1610058
64.3274138,-122.5254936,9.2342384
64.1752134,-122.6554360,9.3116664
64.0215627,-122.7834268,9.3878423
63.8667246,-122.9098285,9.4628014
63.7107488,-123.0351675,9.5365771
63.5541765,-123.1595691,9.6092014
63.3972185,-123.2833859,9.6807050
63.2399150,-123.4070092,9.7511169
63.0825504,-123.5304075,9.8204653
62.9251272,-123.6536686,9.8887770
62.7675536,-123.7769092,9.9560776
62.6099848,-123.9000505,10.0223920
62.4524072,-124.0231449,10.0877437
62.2947718,-124.1462712,10.1521556
62.1371779,-124.2693853,10.2156495
61.9796065,-124.3925187,10.2782467
61.8220325,-124.5156888,10.3399674
61.6644853,-124.6388626,10.4008311
61.5069322,-124.7620567,10.4608567
61.3493996,-124.8852462,10.5200625
61.1918641,-125.0084562,10.5784660
61.0343304,-125.1316915,10.6360842
60.8768355,-125.2549309,10.6929335
60.7193504,-125.3782052,10.7490298
60.5618797,-125.5015188,10.8043883
60.4044575,-125.6248532,10.8590240
60.2470579,-125.7482367,10.9129511
60.0896854,-125.8716731,10.9661838
59.9323689,-125.9951450,11.0187353
59.7750827,-126.1186728,11.0706188
59.6178266,-126.2422552,11.1218471
59.4606224,-126.3658725,11.1724324
59.3034467,-126.4895407,11.2223866
59.1462984,-126.6132581,11.2717214
58.9891965,-126.7370075,11.3204481
58.8321206,-126.8608024,11.3685776
58.6750697,-126.9846413,11.4161205
58.5180597,-127.1085092,11.4630873
58.3610732,-127.2324175,11.5094880
58.2041091,-127.3563647,11.5553324
58.0471809,-127.4803377,11.6006301
57.8902735,-127.6043463,11.6453904
57.7333860,-127.7283887,11.6896223
57.5765295,-127.8524539,11.7333347
57.4196911,-127.9765497,11.7765362
57.2628700,-128.1006746,11.8192351
57.1060752,-128.2248190,11.8614397
56.9492958,-128.3489893,11.9031578
56.7925309,-128.4731840,11.9443974
56.6357880,-128.5973948,11.9851660
56.4790577,-128.7216270,12.0254711
56.3223389,-128.8458790,12.0653198
56.1656381,-128.9701435,12.1047193
56.0089469,-129.0944249,12.1436764
55.8522642,-129.2187219,12.1821980
55.6955957,-129.3430276,12.2202906
55.5389340,-129.4673457,12.2579607
55.3822772,-129.5916753,12.2952146
55.2256312,-129.7160097,12.3320586
55.0689887,-129.8403530,12.3684985
54.9123488,-129.9647020,12.4045404
54.7557255,-130.0890434,12.4401901
54.5991115,-130.2133978,12.4754531
54.4424932,-130.3378202,12.5103351
54.2859845,-130.4622841,12.5448414
54.1295355,-130.5868770,12.5789775
53.9731641,-130.7116022,12.6127484
53.8169206,-130.8364086,12.6461594
53.6607347,-130.9613300,12.6792154
53.5046033,-131.0863444,12.7119213
53.3485543,-131.2114051,12.7442820
53.1925327,-131.3365317,12.7763021
53.0365354,-131.4617027,12.8079862
52.8805750,-131.5868839,12.8393390
52.7246119,-131.7120831,12.8703648
52.5686422,-131.8372797,12.9010681
52.4126664,-131.9624500,12.8573196
52.2566582,-132.0875918,12.6225603
52.1006120,-132.2126867,12.3862198
51.9445202,-132.3377181,12.1480805
51.7883664,-132.4626766,11.9079195
51.6321431,-132.5875463,11.6654960
51.4758385,-132.7123148,11.4205436
51.3194429,-132.8369686,11.1727847
51.1629465,-132.9614942,10.9219148
51.0063373,-133.0858806,10.6675965
50.8496078,-133.2101126,10.4109285
50.6927277,-133.3341546,10.1539801
50.5356205,-133.4579120,9.9092207
50.3780879,-133.5811260,9.6792818
50.2198684,-133.7034538,9.4657014
50.0606751,-133.8245182,9.2676328
49.9002423,-133.9439242,9.0844182
49.7383029,-134.0612805,8.9154853
49.5746171,-134.1761797,8.7603477
49.4089565,-134.2882099,8.6186554
49.2411114,-134.3969514,8.4901108
49.0709411,-134.5019474,8.3744640
48.8982374,-134.6027917,8.2715077
48.7229186,-134.6990128,8.1811046
48.5449897,-134.7901128,8.1030873
48.3642152,-134.8757330,8.0369596
48.1807792,-134.9553359,7.9825257
47.9948209,-135.0284494,7.9413352
47.8060214,-135.0947609,7.9096761
47.6151005,-135.1537397,7.8778897
47.4218135,-135.2055177,7.8516909
47.2266369,-135.2502647,7.8410517
47.0299249,-135.2882260,7.8443959
46.8319163,-135.3194934,7.8529870
46.6342121,-135.3439538,7.8640025
46.4337153,-135.3620156,7.8755489
46.2338352,-135.3734166,7.8443741
46.0351733,-135.3784167,7.7579612
45.8344145,-135.3773744,7.6540669
45.6346626,-135.3706754,7.5283648
45.4361263,-135.3592098,7.3608902
45.2370734,-135.3430261,7.2034911
45.0380526,-135.3211609,7.0763333
44.8405260,-135.2926975,6.9738049
44.6438964,-135.2566043,6.8897174
44.4486165,-135.2121440,6.8208308
44.2556008,-135.1588675,6.7634024
44.0657096,-135.0965499,6.7116141
43.8788922,-135.0248107,6.6611622
43.6960504,-134.9437779,6.6104746
43.5176073,-134.8535462,6.5579056
43.3441339,-134.7542806,6.5040049
43.1759757,-134.6459816,6.4507539
43.0138014,-134.5288270,6.3989140
42.8583328,-134.4030826,6.3490338
42.7100413,-134.2688278,6.3013905
42.5696420,-134.1263699,6.2570033
42.4378345,-133.9760640,6.2166726
42.3150585,-133.8179839,6.1798890
42.2021872,-133.6527850,6.1478484
42.0999514,-133.4810904,6.1212706
42.0087715,-133.3031213,6.0968673
41.9290961,-133.1193647,6.0723660
41.8612786,-132.9311627,6.0595459
41.8051703,-132.7394882,6.0609907
41.7603887,-132.5448408,6.0766206
41.7265153,-132.3473680,6.1057790
41.7033841,-132.1486740,6.1449167
41.6905317,-131.9495447,6.1942429
41.6876588,-131.7500462,6.2451117
41.6946639,-131.5500431,6.2950011
41.7111785,-131.3510089,6.3496324
41.7366810,-131.1531595,6.4139880
41.7709343,-130.9562923,6.4788331
41.8138021,-130.7605378,6.5425442
41.8649587,-130.5668937,6.6041074
41.9239292,-130.3764454,6.6629851
41.9909644,-130.1879136,6.7204608
42.0658548,-130.0017186,6.7769349
42.1476285,-129.8197751,6.8324402
42.2366768,-129.6406940,6.8889551
42.3327305,-129.4647229,6.9467615
42.4348625,-129.2931007,7.0057500
42.5432844,-129.1249734,7.0679361
42.6576105,-128.9605315,7.1335409
42.7771077,-128.8003369,7.2024748
42.9018013,-128.6438363,7.2770264
43.0311207,-128.4912450,7.3570362
43.1648069,-128.3423380,7.4427879
43.3023470,-128.1971147,7.5366976
43.4433798,-128.0554330,7.6368493
43.5878107,-127.9169525,7.7419278
43.7351244,-127.7818054,7.8470774
43.8852585,-127.6497247,7.9500096
44.0380435,-127.5205817,8.0508161
44.1931375,-127.3944124,8.1495821
44.3505133,-127.2710093,8.2463872
44.5100220,-127.1502863,8.3413060
44.6713998,-127.0322521,8.4344080
44.8346559,-126.9167218,8.5257589
44.9996558,-126.8036278,8.6154201
45.1661747,-126.6929650,8.7034495
45.3342469,-126.5845581,8.7899019
45.5037447,-126.4783448,8.8748288
45.6744794,-126.3742974,8.9582790
45.8464811,-126.2722533,9.0402989
46.0196215,-126.1721457,9.1209321
46.1937756,-126.0739012,9.2002204
46.3689287,-125.9773760,9.2782033
46.5449194,-125.8824976,9.3549184
46.7217446,-125.7891254,9.4304017
46.8993102,-125.6970856,9.5046872
47.0772959,-125.6061431,9.5778076
47.2557729,-125.5157140,9.6497941
47.4342740,-125.4254550,9.7206765
47.6125484,-125.3349530,9.5612282
47.7905895,-125.2436723,9.3290344
47.9679796,-125.1512901,9.1113503
48.1445350,-125.0573713,8.9073868
48.3200954,-124.9614667,8.7165350
48.4943017,-124.8632331,8.5383683
48.6669443,-124.7622422,8.3726481
48.8377041,-124.6581219,8.2192792
49.0062711,-124.5504885,8.0783184
49.1722984,-124.4389749,7.9498947
49.3353763,-124.3232522,7.8341985
49.4951409,-124.2029574,7.7314620
49.6510975,-124.0778276,7.6417430
49.8028371,-123.9475463,7.5650875
49.9497524,-123.8119905,7.5013904
50.0913890,-123.6709463,7.4495689
50.2274199,-123.5241115,7.4089959
50.3567683,-123.3720918,7.3794590
50.4795569,-123.2142394,7.3498034
50.5955975,-123.0509918,7.3295459
50.7048885,-122.8833065,7.3321363
50.8078699,-122.7114089,7.3534293
50.9043823,-122.5363289,7.3863831
50.9953238,-122.3570100,7.4275411
51.0797388,-122.1760270,7.4771019
51.1585036,-121.9925815,7.5355402
51.2327926,-121.8054364,7.6146830
51.3021237,-121.6181862,7.7203195
51.3683000,-121.4311004,7.8259307
51.4338703,-121.2425786,7.9293050
51.4980943,-121.0539121,8.0305356
51.5592817,-120.8642477,8.1297089
51.6163414,-120.6724709,8.2049159
51.6683642,-120.4784876,8.2414970
51.7143068,-120.2840681,8.2513371
51.7541661,-120.0882840,8.2506098
51.7879208,-119.8906213,8.2473180
51.8153780,-119.6923386,8.2453319
51.8367099,-119.4934647,8.2487625
51.8522321,-119.2940164,8.2661220
51.8622836,-119.0942476,8.2967724
51.8672035,-118.8944662,8.3403218
51.8672713,-118.6944609,8.3918754
51.8627049,-118.4944160,8.4497704
51.8537173,-118.2947923,8.5125357
51.8404553,-118.0951803,8.5783180
51.8230699,-117.8958504,8.6463308
51.8017159,-117.6971165,8.7157344
51.7764646,-117.4986383,8.7858704
51.7474456,-117.3007226,8.8563150
51.7147581,-117.1034439,8.9266767
51.6784620,-116.9067025,8.9967341
51.6386638,-116.7107021,9.0662108
51.5954168,-116.5153892,9.1349622
51.5488104,-116.3209029,9.2028573
51.4988878,-116.1272024,9.2697047
51.4457070,-115.9343303,9.3355090
51.3893813,-115.7425335,9.3999917
51.3298524,-115.5514833,9.4630709
51.2672575,-115.3614973,9.5252376
51.2016805,-115.1727605,9.5850551
51.1330373,-114.9848550,9.6432333
51.0616930,-114.7980663,9.7122087
50.9879210,-114.6122141,9.7821434
50.9120250,-114.4271564,9.8510267
50.8343544,-114.2428672,9.9188848
50.7552196,-114.0592166,9.9857430
50.6749165,-113.8760389,10.0516256
50.5937746,-113.6932437,10.1165558
50.5121055,-113.5106976,10.1805561
50.4301981,-113.3282324,10.2436480
50.3483455,-113.1457516,10.3058522
50.2667646,-112.9631667,10.3671886
50.1855896,-112.7803740,10.4276767
50.1049444,-112.5973570,10.4873349
50.0248829,-112.4141011,10.5461811
49.9453921,-112.2305704,10.6042327
49.8664707,-112.0468039,10.6615063
49.7881025,-111.8628165,10.7180181
49.7102548,-111.6785836,10.7737839
49.6329221,-111.4941434,10.8288185
49.5560870,-111.3095107,10.8831368
49.4797207,-111.1246664,10.9367528
49.4038241,-110.9396360,10.9896803
49.3283921,-110.7544134,11.0419327
49.2534258,-110.5689992,11.0935227
49.1789265,-110.3833975,11.1444630
49.1048948,-110.1976107,11.1947657
49.0313295,-110.0116365,11.2444425
48.9582318,-109.8254785,11.2935050
48.8856023,-109.6391386,11.3419643
48.8134403,-109.4526157,11.3898312
48.7417466,-109.2659126,11.4371162
48.6705219,-109.0790309,11.4838295
48.5997657,-108.8919704,11.5299812
48.5294786,-108.7047333,11.5755809
48.4596613,-108.5173210,11.6206380
48.3903135,-108.3297340,11.6651618
48.3214358,-108.1419739,11.7091612
48.2530286,-107.9540421,11.7526449
48.1850921,-107.7659394,11.7956214
48.1176267,-107.5776674,11.8380991
48.0506326,-107.3892271,11.8800859
47.9841103,-107.2006197,11.9215899
47.9180601,-107.0118466,11.9626188
47.8524822,-106.8229086,12.0031799
47.7873771,-106.6338074,12.0432808
47.7227453,-106.4445441,12.0829285
47.6585868,-106.2551193,12.1221300
47.5949016,-106.0655351,12.1608923
47.5316878,-105.8757936,12.1992220
47.4689380,-105.6858975,12.2371256
47.4066421,-105.4958523,12.2746095
47.3447885,-105.3056632,12.3116800
47.2833651,-105.1153337,12.3483432
47.2223603,-104.9248700,12.3846051
47.1617625,-104.7342774,12.4204715
47.1015591,-104.5435584,12.4559482
47.0417388,-104.3527193,12.4910408
46.9822898,-104.1617654,12.5257547
46.9231995,-103.9706985,12.5600954
46.8644565,-103.7795250,12.5940682
46.8060490,-103.5882500,12.6276782
46.7479645,-103.3968751,12.6609304
46.6901912,-103.2054062,12.6938298
46.6327188,-103.0138534,12.7263813
46.5755372,-102.8222066,12.7585896
46.5186465,-102.6304716,12.7904595
46.4620502,-102.4386583,12.8219955
46.4057435,-102.2467495,12.8532020
46.3497295,-102.0547559,12.8840836
46.2940111,-101.8626863,12.9146445
46.2385830,-101.6705219,12.9448890
46.1834484,-101.4782734,12.9748213
46.1286104,-101.2859507,13.0044453
46.0740636,-101.0935343,13.0337653
46.0198113,-100.9010347,13.0627850
45.9658564,-100.7084623,13.0915084
45.9121937,-100.5157976,13.1199393
45.8588263,-100.3230507,13.1480814
45.8057572,-100.1302321,13.1759384
45.7529813,-99.9373227,13.2035138
45.7005016,-99.7443323,13.2308113
45.6483208,-99.5512710,13.2578343
45.5964344,-99.3581207,13.2845863
45.5448448,-99.1648906,13.3110705
45.4935549,-98.9715903,13.3372903
45.4425603,-98.7782029,13.3632490
45.3918634,-98.5847369,13.3889498
45.3414667,-98.3912014,13.4143957
45.2913662,-98.1975805,13.4395900
45.2415642,-98.0038825,13.4645355
45.1920629,-97.8101156,13.4892355
45.1428587,-97.6162652,13.5136926
45.0939538,-97.4223391,13.5379100
45.0453500,-97.2283448,13.5618904
44.9970442,-97.0342687,13.5856366
44.9490382,-96.8401184,13.6091514
44.9013339,-96.6459007,13.6324375
44.8539283,-96.4516029,13.6554976
44.8068231,-96.2572323,13.6783343
44.7600201,-96.0627954,13.7009502
44.7135162,-95.8682798,13.7233479
44.6673135,-95.6736929,13.7455299
44.6214132,-95.4790409,13.7674986
44.5758128,-95.2843117,13.7892566
44.5305138,-95.0895126,13.8108061
44.4855174,-94.8946495,13.8321496
44.4408213,-94.6997080,13.8532895
44.3964252,-94.5047014,13.8742279
44.3523166,-94.3096310,13.8949673
44.3084791,-94.1144990,13.9155097
44.2648960,-93.9193104,13.9358575
44.2215512,-93.7240696,13.9560127
44.1784277,-93.5287784,13.9759775
44.1355094,-93.3334426,13.9957541
44.0927800,-93.1380656,14.0153444
44.0502226,-92.9426505,14.0347506
44.0078211,-92.7472020,14.0539747
43.9655589,-92.5517228,14.0730186
43.9234195,-92.3562175,14.0918843
43.8813865,-92.1606894,14.1105738
43.8394432,-91.9651410,14.1290890
43.7975736,-91.7695783,14.1474317
43.7557609,-91.5740029,14.1656038
43.7139882,-91.3784174,14.1836071
43.6722401,-91.1828293,14.2014435
43.6304991,-90.9872385,14.2191147
43.5887488,-90.7916475,14.2366225
43.5469738,-90.5960659,14.2539686
43.5051564,-90.4004913,14.2711547
43.4632800,-90.2049267,14.2881826
43.4213297,-90.0093834,14.3050538
43.3792794,-89.8138583,14.3217701
43.3370818,-89.6183612,14.3229053
43.2946278,-89.4229274,14.1273428
43.2517611,-89.2275791,13.9420554
43.2083116,-89.0323552,13.7667968
43.1641112,-88.8373121,13.6013531
43.1189839,-88.6424737,13.4455357
43.0727600,-88.4478907,13.2991810
43.0252720,-88.2536233,13.1621506
42.9763463,-88.0597053,13.0343211
42.9258174,-87.8662030,12.9155823
42.8735181,-87.6731727,12.8058425
42.8192835,-87.4806759,12.7050079
42.7629556,-87.2887940,12.6129796
42.7043673,-87.0975709,12.5296922
42.6433737,-86.9071163,12.4550101
42.5798268,-86.7175165,12.3887421
42.5135641,-86.5288030,12.3310435
42.4444755,-86.3411566,12.2818842
42.3724516,-86.1546988,12.2325273
42.2974005,-85.9692101,12.1854790
42.2195581,-85.7850386,12.1456474
42.1389531,-85.6019959,12.1133270
42.0556645,-85.4200633,12.0871764
41.9698569,-85.2394271,12.0662024
41.8815303,-85.0599292,12.0500535
41.7908199,-84.8817075,12.0381128
41.6977103,-84.7046131,12.0297763
41.6023163,-84.5287583,12.0248463
41.5048023,-84.3543355,12.0229704
41.4049190,-84.1808105,12.0238283
41.3030023,-84.0086825,12.0274975
41.1991840,-83.8380667,11.9624881
41.0930456,-83.6681946,11.8549747
40.9851018,-83.4998092,11.7418432
40.8754310,-83.3329249,11.6230433
40.7636017,-83.1668058,11.4984024
40.6501101,-83.0021186,11.3680184
40.5349949,-82.8388440,11.2323105
40.4179854,-82.6765593,11.0915763
40.2993511,-82.5156335,10.9467992
40.1790390,-82.3560412,10.8054116
40.0568153,-82.1977359,10.6810455
39.9325364,-82.0411280,10.5729333
39.8058287,-81.8863507,10.4809608
39.6764851,-81.7337365,10.4049077
39.5443615,-81.5836558,10.3422795
39.4091639,-81.4362443,10.2889781
39.2708380,-81.2917779,10.2413565
39.1293421,-81.1504190,10.1968029
38.9846499,-81.0122889,10.1547115
38.8368466,-80.8775848,10.1142284
38.6859182,-80.7463732,10.0735827
38.5318798,-80.6186803,10.0340689
38.3750508,-80.4946049,10.0038318
38.2156584,-80.3739971,9.9874380
38.0537061,-80.2564220,9.9896008
37.8898043,-80.1418427,10.0114700
37.7241920,-80.0299228,10.0525763
37.5569394,-79.9202103,10.1127612
37.3885193,-79.8125237,10.1768156
37.2191443,-79.7065318,10.2399603
37.0485602,-79.6018755,10.3022162
36.8774483,-79.4991490,10.3636032
36.7049479,-79.3980673,10.4241406
36.5308468,-79.2987599,10.4838471
36.3562272,-79.2020642,10.4724523
36.1800335,-79.1076023,10.3497112
36.0020381,-79.0154712,10.2314395
35.8232839,-78.9263894,10.1167955
35.6428740,-78.8400690,10.0053234
35.4607169,-78.7566438,9.8969614
35.2776510,-78.6766475,9.7912542
35.0928726,-78.5998747,9.6884395
34.9066427,-78.5266003,9.5889159
34.7191397,-78.4570544,9.4928388
34.5301591,-78.3913317,9.4009680
34.3399241,-78.3296940,9.3140207
34.1481806,-78.2722616,9.2329282
33.9553516,-78.2193795,9.1587581
33.7612339,-78.1712232,9.0923407
33.5657548,-78.1280372,9.0354963
33.3696092,-78.0902485,8.9898882
33.1721960,-78.0580371,8.9540489
32.9740670,-78.0317414,8.9180655
32.7752171,-78.0112943,8.8879589
32.5757932,-77.9964574,8.8716873
32.3760669,-77.9869962,8.8676984
32.1760888,-77.9826561,8.8754050
31.9761363,-77.9831772,8.8945210
31.7762384,-77.9882978,8.9240088
31.5763976,-77.9977727,8.9628660
31.3769114,-78.0113552,9.0100931
31.1776865,-78.0288469,9.0636568
30.9787586,-78.0500612,9.1227618
30.7803328,-78.0747998,9.1867561
30.5823059,-78.1029070,9.2551125
30.3847558,-78.1342129,9.3274107
30.1877272,-78.1685567,9.4032938
29.9912115,-78.2057931,9.4780078
29.7952761,-78.2457674,9.5515451
29.5998264,-78.2883633,9.6239375
29.4049746,-78.3334255,9.6952151
29.2107149,-78.3808274,9.7654069
29.0169345,-78.4304744,9.8345408
28.8237620,-78.4822138,9.9026434
28.6311625,-78.5359965,9.9697400
28.4390942,-78.5918654,10.0358553
28.2477028,-78.6498212,10.1010127
28.0569663,-78.7099133,10.1652348
27.8668861,-78.7721835,10.2285434
27.6775788,-78.8366340,10.2909594
27.4890353,-78.9033069,10.3525029
27.3012680,-78.9722370,10.4131935
27.1143881,-79.0434202,10.4730497
26.9283864,-79.1168949,10.5315017
26.7432795,-79.1926898,10.5860733
26.5591857,-79.2707887,10.6370153
26.3760872,-79.3512294,10.6845063
26.1940013,-79.4340351,10.7287694
26.0130606,-79.5191726,10.7700388
25.8332336,-79.6066821,10.8084701
25.6545344,-79.6965825,10.8442731
25.4771138,-79.7888200,10.8776663
25.3009277,-79.8834370,10.9087850
25.1259771,-79.9804540,10.9378224
24.9524355,-80.0797912,10.9649847
24.7802542,-80.1814898,10.9903900
24.6094020,-80.2855838,11.0142107
24.4400821,-80.3919605,11.0366452
24.2722562,-80.5006501,11.0577979
24.1058322,-80.6117224,11.0778155
23.9410524,-80.7250210,11.0968933
23.7779107,-80.8405485,11.1151247
23.6162167,-80.9584436,11.1326265
23.4562648,-81.0784922,11.1495927
23.2980881,-81.2006588,11.1661065
23.1414076,-81.3251561,11.1822582
22.9865343,-81.4517321,11.1982251
22.8335072,-81.5803380,11.2140829
22.6821380,-81.7111193,11.2299111
22.5325542,-81.8439547,11.2458263
22.3848696,-81.9787226,11.2619025
22.2390066,-82.1154711,11.2781999
22.0948821,-82.2542561,11.2947685
21.9526669,-82.3948495,11.3134369
21.8122899,-82.5371464,11.3382029
21.6734517,-82.6811673,11.3733407
21.5362070,-82.8265391,11.4205127
21.4003764,-82.9732663,11.4674264
21.2659052,-83.1213278,11.5137749
21.1328900,-83.2705536,11.5595681
21.0012034,-83.4210409,11.6048154
20.8707902,-83.5728239,11.6495262
20.7419058,-83.7255813,11.6937094
20.6143518,-83.8795315,11.7373740
20.4880680,-84.0347456,11.7805283
20.3632433,-84.1909908,11.8231809
20.2398865,-84.3482528,11.8653399
20.1178188,-84.5067655,11.9070133
19.9971578,-84.6663855,11.9482087
19.8780899,-84.8268657,11.9889339
19.7603402,-84.9885798,12.0291962
19.6439831,-85.1514362,12.0690028
19.5292888,-85.3150532,12.1083609
19.4159463,-85.4798714,12.1472772
19.3040175,-85.6458072,12.1857586
19.1937619,-85.8124673,12.2238117
19.0848932,-85.9802751,12.2614429
18.9774785,-86.1491266,12.2984500
18.8717050,-86.3187135,12.3346867
18.7673528,-86.4893742,12.3703179
18.6644947,-86.6609808,12.4053722
18.5632272,-86.8333538,12.4399025
18.4634115,-87.0067110,12.4740417
18.3651152,-87.1809187,12.5077975
18.2683593,-87.3559176,12.5412214
18.1730801,-87.5318008,12.5744046
18.0793226,-87.7084632,12.6073397
17.9870679,-87.8859154,12.6400783
17.8963074,-88.0641487,12.6726686
17.8070474,-88.2431249,12.7050932
17.7192696,-88.4228542,12.7373992
17.6329957,-88.6032643,12.7694917
17.5481834,-88.7844164,12.8012472
17.4648482,-88.9662510,12.8326704
17.3830191,-89.1486744,12.8637657
17.3026050,-89.3318641,12.8945374
17.2236718,-89.5156457,12.9249900
17.1462425,-89.6999328,12.9551276
17.0701877,-89.8850104,12.9849543
16.9956343,-90.0705526,13.0144743
16.9224975,-90.2566307,13.0436914
16.8506447,-90.4433144,13.0726097
16.7800341,-90.6304208,13.1012330
16.7105600,-90.8179284,13.1295650
16.6420994,-91.0058710,13.1576095
16.5745987,-91.1941207,13.1853701
16.5079856,-91.3826753,13.2128504
16.4422096,-91.5715661,13.2400539
16.3772697,-91.7607153,13.2669842
16.3131366,-91.9501346,13.2936445
16.2497786,-92.1398439,13.3200382
16.1871901,-92.3297854,13.3461687
16.1253430,-92.5199679,13.3720391
16.0642092,-92.7104010,13.3976526
16.0037777,-92.9010412,13.4230124
15.9440215,-93.0918940,13.4481215
15.8849150,-93.2829628,13.4729830
15.8264433,-93.4742145,13.4975999
15.7685807,-93.6656521,13.5219750
15.7113028,-93.8572745,13.5461112
15.6545923,-94.0490571,13.5700115
15.5984243,-94.2410001,13.5936785
15.5427754,-94.4331003,13.6171150
15.4876266,-94.6253387,13.6403238
15.4329537,-94.8177139,13.6633074
15.3787340,-95.0102213,13.6860686
15.3249472,-95.2028460,13.7086098
15.2715700,-95.3955853,13.7309337
15.2185797,-95.5884341,13.7530427
15.1659556,-95.7813803,13.7749393
15.1136748,-95.9744202,13.7966260
15.0617149,-96.1675489,13.8181050
15.0100547,-96.3607557,13.8393789
14.9586718,-96.5540368,13.8604498
14.9075436,-96.7473873,13.8813201
14.8566492,-96.9407974,13.9019921
14.8059661,-97.1342632,13.9224679
14.7554719,-97.3277804,13.9427498
14.7051458,-97.5213391,13.9628398
14.6549652,-97.7149359,13.9827403
14.6049077,-97.9085669,14.0024531
14.5549528,-98.1022215,14.0219804
14.5050779,-98.2958972,14.0413243
14.4552605,-98.4895904,14.0604868
14.4054803,-98.6832899,14.0794697
14.3557144,-98.8769936,14.0982751
14.3059406,-99.0706983,14.1169050
14.2561386,-99.2643919,14.1353611
14.2062855,-99.4580731,14.1536455
14.1563587,-99.6517387,14.1717598
14.1063385,-99.8453757,14.1897061
14.0562015,-100.0389836,14.2074859
14.0059253,-100.2325590,14.2251012
13.9554901,-100.4260881,14.2425537
13.9048724,-100.6195708,14.2598451
13.8540497,-100.8130034,14.2769771
13.8030023,-101.0063717,14.2939514
13.7517065,-101.1996758,14.3107696
13.7001398,-101.3929112,14.3274335
13.6482824,-101.5860638,14.3439445
13.5961105,-101.7791332,14.3603044
13.5436017,-101.9721142,14.3765146
13.4907357,-102.1649934,14.3925768
13.4374891,-102.3577693,14.4084924
13.3838394,-102.5504354,14.4242630
13.3297659,-102.7429798,14.4398901
13.2752452,-102.9353994,14.4553752
13.2202554,-103.1276861,14.4707197
13.1647748,-103.3198303,14.4859251
13.1087806,-103.5118266,14.5009927
13.0522512,-103.7036646,14.5159240
12.9951639,-103.8953384,14.5307204
12.9374965,-104.0868392,14.5453833
12.8792284,-104.2781540,14.5599139
12.8203350,-104.4692817,14.5743137
12.7607957,-104.6602094,14.4723169
12.7005905,-104.8509206,14.2999277
12.6396930,-105.0414207,14.1272470
12.5780841,-105.2316914,13.9541805
12.5157454,-105.4217124,13.7806252
12.4526476,-105.6114971,13.6064790
12.3887741,-105.8010203,13.4316452
12.3241083,-105.9902571,13.2559580
12.2586167,-106.1792344,13.0793490
12.1922872,-106.3679135,12.9018832
12.1251100,-106.5562430,12.7235618
12.0570328,-106.7442859,12.5436782
11.9880476,-106.9320104,12.3611776
11.9181709,-107.1193390,12.1815790
11.8472550,-107.3064008,12.0071987
11.7752325,-107.4929763,11.8387124
11.7019568,-107.6790221,11.6758949
11.6272400,-107.8645930,11.5185153
11.5510028,-108.0494730,11.3663130
11.4730896,-108.2336411,11.2190653
11.3933330,-108.4171003,11.0765790
11.3116625,-108.5996325,10.9386610
11.2279146,-108.7812360,10.8051513
11.1419442,-108.9618623,10.6759188
11.0536877,-109.1412943,10.5508506
10.9629773,-109.3195329,10.4298742
10.8696888,-109.4964830,10.3129350
10.7737623,-109.6719313,10.2000443
10.6750310,-109.8458606,10.0912523
10.5733920,-110.0181296,9.9866156
10.4687710,-110.1885494,9.8862124
10.3610253,-110.3570413,9.7904811
10.2500568,-110.5234357,9.6999321
10.1357747,-110.6875515,9.6120978
10.0180694,-110.8492989,9.5255090
9.8969693,-111.0084667,9.4381316
9.7723656,-111.1650869,9.3497739
9.6444752,-111.3187865,9.2603278
9.5131283,-111.4696743,9.1699670
9.3783033,-111.6176784,9.0778365
9.2404293,-111.7622702,8.9833650
9.0990270,-111.9038947,8.8864666
8.9542918,-112.0422873,8.7861369
8.8067718,-112.1769125,8.6816817
8.6559196,-112.3082617,8.5726682
8.5017930,-112.4362530,8.4580018
8.3451360,-112.5602890,8.3368258
8.1858889,-112.6804739,8.2084891
8.0231213,-112.7975052,8.0720237
7.8580815,-112.9104743,7.9276133
7.6907216,-113.0194228,7.7757185
7.5207874,-113.1244346,7.6173440
7.3480716,-113.2254200,7.4601258
7.1731658,-113.3216939,7.3141590
6.9954950,-113.4129618,7.1934876
6.8142832,-113.4984661,7.1190109
6.6304715,-113.5762414,7.0794603
6.4430263,-113.6455834,7.0512372
6.2521426,-113.7059001,7.0229006
6.0585172,-113.7569511,6.9974152
5.8632127,-113.7986702,6.9806249
5.6658501,-113.8313608,6.9731463
5.4670512,-113.8551280,6.9748163
5.2677201,-113.8701805,6.9858262
5.0677991,-113.8769595,7.0114626
4.8677241,-113.8759243,7.0518303
4.6678981,-113.8676010,7.1064720
4.4683475,-113.8525439,7.1758784
4.2694495,-113.8313721,7.2606638
4.0713737,-113.8047430,7.3609258
3.8736078,-113.7732511,7.4745275
3.6767265,-113.7377117,7.5855373
3.4808021,-113.6989498,7.6940744
3.2849560,-113.6577115,7.8002490
3.0897199,-113.6152353,7.9041629
2.8947721,-113.5722389,8.0059108
2.6992782,-113.5288481,8.1055807
2.5045793,-113.4853096,8.2032549
2.3096236,-113.4413511,8.2990098
2.1142528,-113.3968695,8.3929175
1.9194938,-113.3520194,8.4850450
1.7248820,-113.3066538,8.5754558
1.5299141,-113.2606365,8.6642094
1.3353769,-113.2141575,8.7513617
1.1410086,-113.1671839,8.8369659
0.9465180,-113.1196873,8.9210718
0.7523168,-113.0718181,9.0037269
0.5580979,-113.0235546,9.0849761
0.3640708,-112.9749990,9.1648620
0.1700789,-112.9261562,9.2434249
-0.0239743,-112.8770363,9.3207035
-0.2176439,-112.8277731,9.3967343
-0.4114553,-112.7782490,9.4715523
-0.6052810,-112.7285174,9.5451908
-0.7987117,-112.6786991,9.6176815
-0.9923000,-112.6287158,9.6106493
-1.1857877,-112.5788586,9.3554961
-1.3796669,-112.5296814,9.1313127
-1.5739898,-112.4820297,8.9361915
-1.7687354,-112.4367410,8.7689253
-1.9642971,-112.3945408,8.6275587
-2.1606109,-112.3562147,8.5103995
-2.3578008,-112.3224307,8.4082216
-2.5557956,-112.2937332,8.3188320
-2.7543018,-112.2705905,8.2405609
-2.9537889,-112.2533289,8.1709290
-3.1535713,-112.2423533,8.1096464
-3.3532550,-112.2379659,8.0564985
-3.5534874,-112.2404375,8.0094217
-3.7534346,-112.2500235,7.9676819
-3.9525061,-112.2668815,7.9307634
-4.1508930,-112.2911920,7.8974647
-4.3486818,-112.3231493,7.8659804
-4.5447364,-112.3626856,7.8343697
-4.7387521,-112.4096615,7.8066730
-4.9312492,-112.4637347,7.7943734
-5.1219693,-112.5236004,7.8373534
-5.3107856,-112.5881998,7.9120729
-5.4983954,-112.6572693,8.0002465
-5.6847394,-112.7306686,8.0881935
-5.8686489,-112.8078547,8.1739908
-6.0510729,-112.8892592,8.2513172
-6.2320999,-112.9750390,8.3207344
-6.4109385,-113.0649238,8.3826379
-6.5870462,-113.1586975,8.4373397
-6.7614540,-113.2569818,8.4861947
-6.9336729,-113.3595967,8.5299984
-7.1025347,-113.4658613,8.5692997
-7.2692963,-113.5765833,8.6054279
-7.4333930,-113.6914454,8.6385132
-7.5941679,-113.8099870,8.6687216
-7.7523048,-113.9327173,8.6970229
-7.9072778,-114.0592555,8.7231097
-8.0590165,-114.1895479,8.7470926
-8.2075449,-114.3236213,8.7696743
-8.3526403,-114.4612899,8.7903389
-8.4943010,-114.6025777,8.8088273
-8.6322705,-114.7472170,8.8264470
-8.7667414,-114.8953021,8.8452626
-8.8976613,-115.0464728,8.8730200
-9.0251344,-115.2004972,8.9092622
-9.1493688,-115.3572835,8.9532029
-9.2703812,-115.5164967,9.0046627
-9.3883232,-115.6779599,9.0634486
-9.5034006,-115.8415743,9.1293296
-9.6156899,-116.0070561,9.2021593
-9.7253720,-116.1742636,9.2801105
-9.8326466,-116.3430860,9.3567948
-9.9376377,-116.5132908,9.4322481
-10.0405464,-116.6847640,9.5065045
-10.1415735,-116.8573954,9.5795966
-10.2408549,-117.0309875,9.6515555
-10.3385686,-117.2054847,9.7224110
-10.4348194,-117.3808219,9.7921917
-10.5296380,-117.5568822,9.8609248
-10.6231123,-117.7336983,9.9286364
-10.7152758,-117.9112142,9.9953517
-10.8061434,-118.0893371,10.0610949
-10.8958085,-118.2681270,10.1258890
-10.9842920,-118.4475016,10.1897562
-11.0716173,-118.6273796,10.2527182
-11.1578868,-118.8078434,10.3147954
-11.2431114,-118.9887853,10.3760077
-11.3273215,-119.1701358,10.4363744
-11.4106265,-119.3519964,10.4959138
-11.4930287,-119.5342374,10.5546437
-11.5745647,-119.7168012,10.6125815
-11.6553471,-119.8998024,10.6697438
-11.7353730,-120.0830965,10.7261465
-11.8146831,-120.2666364,10.7818054
-11.8933895,-120.4505421,10.8367353
-11.9714874,-120.6346639,10.8909509
-12.0490201,-120.8189632,10.9444663
-12.1260946,-121.0035560,10.9972952
-12.2027084,-121.1882988,11.0494507
-12.2789053,-121.3731597,11.1009458
-12.3547830,-121.5582400,11.1517930
-12.4303445,-121.7434142,11.2020042
-12.5056341,-121.9286555,11.2515913
-12.5807358,-122.1140405,11.3005657
-12.6556568,-122.2994738,11.3489384
-12.7304527,-122.4849249,11.3967203
-12.8052424,-122.6704194,11.4439218
-12.8801525,-122.8558405,11.4905532
-12.9553471,-123.0411528,11.5366243
-13.0309733,-123.2262888,11.5821447
-13.1071783,-123.4111743,11.5097641
-13.1841326,-123.5957858,11.3085459
-13.2619657,-123.7799961,11.1128922
-13.3408375,-123.9637451,10.9226557
-13.4209382,-124.1470313,10.7376140
-13.5023807,-124.3296689,10.5577093
-13.5853326,-124.5115888,10.3828742
-13.6700152,-124.6928249,10.2128977
-13.7565148,-124.8731117,10.0477482
-13.8450053,-125.0523676,9.8874058
-13.9357554,-125.2306828,9.7315670
-14.0287857,-125.4076540,9.5800593
-14.1242934,-125.5832229,9.4356877
-14.2226656,-125.7575455,9.3013552
-14.3238921,-125.9298623,9.1895773
-14.4285526,-126.1000549,9.1056834
-14.5375166,-126.2681866,9.0499467
-14.6503930,-126.4325327,9.0017985
-14.7682356,-126.5941528,8.9560550
-14.8909218,-126.7526068,8.9108399
-15.0177068,-126.9068462,8.8672020
-15.1494915,-127.0578197,8.8261597
-15.2854251,-127.2043800,8.7863328
-15.4259630,-127.3469079,8.7476305
-15.5707768,-127.4849463,8.7109775
-15.7199805,-127.6184847,8.6742666
-15.8731626,-127.7470717,8.6389508
-16.0305630,-127.8708185,8.6036925
-16.1920192,-127.9894991,8.5683676
-16.3563073,-128.1022090,8.5342087
-16.5258712,-128.2105140,8.4999126
-16.6978475,-128.3125166,8.4682081
-16.8724653,-128.4084677,8.4384310
-17.0520472,-128.4996350,8.4126782
-17.2331348,-128.5844155,8.3966685
-17.4154927,-128.6632374,8.3961679
-17.6014082,-128.7377738,8.4227797
-17.7890198,-128.8082110,8.4054064
-17.9764711,-128.8753207,8.2108141
-18.1644746,-128.9398742,8.0484829
-18.3545144,-129.0007987,7.9555999
-18.5470174,-129.0562442,7.8888310
-18.7415937,-129.1051698,7.8416034
-18.9361349,-129.1465375,7.8043049
-19.1329397,-129.1805396,7.7717910
-19.3318787,-129.2068489,7.7408078
-19.5313522,-129.2251249,7.7097000
-19.7304772,-129.2353569,7.6806594
-19.9309141,-129.2376798,7.6571316
-20.1311301,-129.2321181,7.6389977
-20.3303614,-129.2188732,7.6271549
-20.5296677,-129.1980457,7.6237108
-20.7276653,-129.1699617,7.6276307
-20.9245887,-129.1348458,7.6403050
-21.1203596,-129.0929740,7.6625043
-21.3144576,-129.0447589,7.6934084
-21.5070962,-128.9904962,7.7353837
-21.6978308,-128.9306887,7.7879557
-21.8872714,-128.8655448,7.8512882
-22.0746242,-128.7957923,7.9275078
-22.2603437,-128.7217349,8.0152908
-22.4446812,-128.6437203,8.1145390
-22.6270970,-128.5623952,8.2120356
-22.8083929,-128.4777835,8.3076198
-22.9883253,-128.3903304,8.4013629
-23.1667356,-128.3004301,8.4933319
-23.3442234,-128.2080637,8.5835897
-23.5205484,-128.1136072,8.6721954
-23.6956658,-128.0173248,8.7592049
-23.8700033,-127.9191994,8.8446709
-24.0434187,-127.8195098,8.9286430
-24.2158888,-127.7184628,9.0111686
-24.3877089,-127.6160684,9.0922921
-24.5588450,-127.5125226,9.1720561
-24.7292826,-127.4080098,9.2505008
-24.8992230,-127.3025838,9.3276644
-25.0687076,-127.1964003,9.4035836
-25.2377712,-127.0896224,9.4782930
-25.4065377,-126.9823242,9.5518259
-25.5749639,-126.8745631,9.6242139
-25.7428322,-126.7660937,9.6954873
-25.9102145,-126.6564003,9.7656750
-26.0763565,-126.5456683,9.8348049
-26.2419160,-126.4334165,9.9029035
-26.4068061,-126.3196854,9.9699963
-26.5702547,-126.2049569,10.0361078
-26.7330127,-126.0886560,10.1012616
-26.8949084,-125.9708390,10.1654802
-27.0553766,-125.8518524,10.2287853
-27.2149834,-125.7312054,10.2911979
-27.3734566,-125.6090197,10.3527381
-27.5305361,-125.4854166,10.4134254
-27.6865135,-125.3600813,10.4732785
-27.8410949,-125.2331593,10.5323155
-27.9942607,-125.1045796,10.5905537
-28.1460371,-124.9742286,10.6480101
-28.2962332,-124.8421791,10.7047010
-28.4448808,-124.7083134,10.7581408
-28.5918273,-124.5726800,10.8060899
-28.7371271,-124.4351388,10.8486482
-28.8806130,-124.2957600,10.8863530
-29.0221493,-124.1545957,10.9193584
-29.1619608,-124.0113346,10.9478423
-29.2996456,-123.8663081,10.9723837
-29.4352445,-123.7194048,10.9930889
-29.5689314,-123.5703563,11.0102710
-29.7002237,-123.4196351,11.0244480
-29.8293368,-123.2669395,11.0357403
-29.9563354,-123.1121244,11.0445744
-30.0807331,-122.9557382,11.0514204
-30.2028124,-122.7973936,11.0564487
-30.3226599,-122.6369268,11.0601135
-30.4397763,-122.4749843,11.0628513
-30.5543184,-122.3113525,11.0648605
-30.6666695,-122.1454538,11.0664780
-30.7762235,-121.9781688,11.0679117
-30.8830029,-121.8094892,11.0691238
-30.9874324,-121.6387244,11.0700952
-31.0891514,-121.4664143,11.0701931
-31.1880162,-121.2927464,11.0681310
-31.2840465,-121.1175753,11.0627474
-31.3773093,-120.9405562,11.0529450
-31.4673858,-120.7621211,11.0330133
-31.5541896,-120.5821954,11.0073605
-31.6378498,-120.4003889,10.9801179
-31.7179920,-120.2174555,10.9546827
-31.7946685,-120.0329588,10.9207061
-31.8678426,-119.8466788,10.8827208
-31.9373420,-119.6587994,10.8421721
-32.0027727,-119.4702320,10.7993619
-32.0644422,-119.2799879,10.7563762
-32.1222649,-119.0881765,10.7140282
-32.1759558,-118.8957359,10.6729519
-32.2256977,-118.7020999,10.6345068
-32.2715272,-118.5071792,10.5993712
-32.3133230,-118.3116667,10.5678313
-32.3511965,-118.1153531,10.5407818
-32.3852372,-117.9181060,10.5187681
-32.4154384,-117.7204331,10.5018377
-32.4419191,-117.5222106,10.4906687
-32.4647843,-117.3234273,10.4856591
-32.4841160,-117.1243792,10.4867658
-32.5000529,-116.9249808,10.4946123
-32.5127220,-116.7253696,10.5094433
-32.5222701,-116.5255739,10.5312413
-32.5288526,-116.3256681,10.5608086
-32.5325867,-116.1257709,10.5952696
-32.5335623,-115.9257683,10.6331736
-32.5318454,-115.7258010,10.6730189
-32.5274919,-115.5258630,10.7142584
-32.5205478,-115.3260004,10.7564606
-32.5110482,-115.1262460,10.7987877
-32.4990172,-114.9265939,10.8408667
-32.4844787,-114.7271499,10.8823920
-32.4674408,-114.5278859,10.9228503
-32.4479077,-114.3288218,10.9620132
-32.4258876,-114.1300603,10.9996735
-32.4013693,-113.9315672,11.0355065
-32.3743465,-113.7333954,11.0693641
-32.3448087,-113.5355923,11.1010965
-32.3127367,-113.3381733,11.1304696
-32.2781179,-113.1412150,11.1574042
-32.2409164,-112.9446804,11.1818048
-32.2011159,-112.7486736,11.2033240
-32.1586991,-112.5532709,11.2221907
-32.1136061,-112.3583751,11.2385600
-32.0658290,-112.1642105,11.2506928
-32.0153362,-111.9707144,11.2613165
-31.9621966,-111.7779410,11.2739520
-31.9065268,-111.5858527,11.2938181
-31.8484665,-111.3944467,11.3206577
-31.7881706,-111.2037879,11.3537679
-31.7257469,-111.0137816,11.3932021
-31.6613251,-110.8244244,11.4384378
-31.5950360,-110.6357627,11.4851352
-31.5269205,-110.4477166,11.5312713
-31.4570348,-110.2603132,11.5768556
-31.3854333,-110.0735966,11.6218976
-31.3121317,-109.8875092,11.6664065
-31.2371788,-109.7020808,11.7103912
-31.1606220,-109.5173336,11.7538605
-31.0824818,-109.3332254,11.7968229
-31.0028074,-109.1497817,11.8392867
-30.9216392,-108.9670066,11.8812599
-30.8390040,-108.7848731,11.9227504
-30.7549488,-108.6033986,11.9637660
-30.6695089,-108.4225750,12.0043141
-30.5827172,-108.2423882,12.0444021
-30.4946160,-108.0628441,12.0840372
-30.4052387,-107.8839296,12.1232263
-30.3146230,-107.7056400,12.1619763
-30.2228046,-107.5279667,12.2002939
-30.1298181,-107.3508986,12.2381856
-30.0357044,-107.1744361,12.2756578
-29.9404914,-106.9985550,12.3127167
-29.8442180,-106.8232517,12.3493686
-29.7469262,-106.6485274,12.3856192
-29.6486355,-106.4743426,12.4214746
-29.5493915,-106.3007049,12.4569404
-29.4492351,-106.1276119,12.4920223
-29.3481785,-105.9550124,12.5267257
-29.2462745,-105.7829247,12.5610560
-29.1435607,-105.6113400,12.5950185
-29.0400453,-105.4402011,12.6286183
-28.9357862,-105.2695331,12.6618605
-28.8308154,-105.0993180,12.6947501
-28.7251439,-104.9295040,12.7272919
-28.6188286,-104.7601129,12.7594906
-28.5118946,-104.5911168,12.7913511
-28.4043635,-104.4224825,12.8228777
-28.2962796,-104.2542051,12.8540751
-28.1876687,-104.0862812,12.8849476
-28.0785143,-103.9186865,12.9154995
-27.9688246,-103.7514650,12.9457352
-27.8585720,-103.5846110,12.9756587
-27.7477416,-103.4181346,13.0052742
-27.6363233,-103.2520546,13.0345856
-27.5242984,-103.0863779,13.0635969
-27.4116585,-102.9211269,13.0923121
-27.2983817,-102.7563046,13.1207348
-27.1844551,-102.5919273,13.1488688
-27.0698717,-102.4280201,13.1767178
-26.9546047,-102.2645800,13.2042854
-26.8386457,-102.1016303,13.2315751
-26.7219860,-101.9391936,13.2585905
-26.6045984,-101.7772676,13.2853348
-26.4864777,-101.6158796,13.3118116
-26.3676118,-101.4550477,13.3380240
-26.2479768,-101.2947744,13.3639754
-26.1275681,-101.1350877,13.3896690
-26.0063707,-100.9760019,13.4151078
-25.8843658,-100.8175263,13.4402950
-25.7615472,-100.6596865,13.4652336
-25.6378984,-100.5024950,13.4899267
-25.5134066,-100.3459685,13.5143771
-25.3880610,-100.1901270,13.5385877
-25.2618471,-100.0349850,13.5625615
-25.1347567,-99.8805653,13.5863011
-25.0067733,-99.7268802,13.6098094
-24.8778869,-99.5739500,13.6330891
-24.7480928,-99.4218011,13.6561429
-24.6173674,-99.2704376,13.6789734
-24.4857080,-99.1198881,13.7015831
-24.3531107,-98.9701811,13.7239747
-24.2195428,-98.8213158,13.7461507
-24.0850036,-98.6733357,13.7681135
-23.9494822,-98.5262745,13.7898655
-23.8129360,-98.3801335,13.8114092
-23.6753702,-98.2349650,13.8324680
-23.5367720,-98.0908011,13.8508438
-23.3971007,-97.9476452,13.8666011
-23.2563638,-97.8055503,13.8797990
-23.1145488,-97.6645465,13.8905750
-22.9716251,-97.5246471,13.8990241
-22.8276048,-97.3859102,13.9047967
-22.6824508,-97.2483086,13.9100022
-22.5362499,-97.1118875,13.9168293
-22.3889789,-96.9765681,13.9266137
-22.2406886,-96.8423409,13.9390864
-22.0914577,-96.7092247,13.9539126
-21.9412677,-96.5771500,13.9711607
-21.7901681,-96.4461086,13.9907389
-21.6382110,-96.3160948,14.0103764
-21.4853998,-96.1870612,14.0298293
-21.3317804,-96.0589974,14.0490995
-21.1773788,-95.9318765,14.0681891
-21.0222241,-95.8056749,14.0871000
-20.8663513,-95.6803736,14.1058341
-20.7097675,-95.5559319,14.1243935
-20.5525277,-95.4323475,14.1427799
-20.3946487,-95.3095879,14.1609952
-20.2361285,-95.1876066,14.1790413
-20.0770453,-95.0664188,14.1969200
-19.9173918,-94.9459740,14.2146331
-19.7571676,-94.8262280,14.2321823
-19.5964686,-94.7072078,14.2495694
-19.4352620,-94.5888444,14.2667961
-19.2735552,-94.4710996,14.2838641
-19.1114575,-94.3540079,14.3007750
-18.9489129,-94.2374839,14.3175306
-18.7859376,-94.1214949,14.3341324
-18.6226506,-94.0060798,14.3505821
-18.4589806,-93.8911424,14.3668812
-18.2949465,-93.7766502,14.3830314
-18.1306755,-93.6626453,14.3990340
-17.9660929,-93.5490286,14.4148908
-17.8012083,-93.4357596,14.4306032
-17.6361574,-93.3228834,14.4461727
-17.4708754,-93.2103068,14.4616007
-17.3053500,-93.0979727,14.4768887
-17.1397249,-92.9859295,14.4920382
-16.9739560,-92.8740973,14.5070505
-16.8080019,-92.7623983,14.5219270
-16.6420118,-92.6508832,14.5366692
-16.4759630,-92.5394863,14.5512784
-16.3097936,-92.4281154,14.5657560
-16.1436510,-92.3168234,14.5801032
-15.9775177,-92.2055438,14.5943213
-15.8113927,-92.0942233,14.6084118
-15.6452995,-91.9828847,14.6223758
-15.4791435,-91.8714945,14.6362147
-15.3130508,-91.7601718,14.6499296
-15.1469146,-91.6488704,14.6635219
-14.9806832,-91.5375804,14.6769926
-14.8144773,-91.4264080,14.6903432
-14.6482089,-91.3153192,14.7035746
-14.4818026,-91.2042880,14.7166882
-14.3153768,-91.0934174,14.7296851
-14.1488736,-90.9826916,14.7425664
-13.9821976,-90.8720700,14.7553332
-13.8154594,-90.7616477,14.7679868
-13.6486256,-90.6514232,14.7805281
-13.4815926,-90.5413482,14.7929584
-13.3144621,-90.4315091,14.8052786
-13.1472124,-90.3219100,14.8174899
-12.9797453,-90.2125041,14.8295933
-12.8121531,-90.1033689,14.8415898
-12.6444141,-89.9945064,14.8534806
-12.4764466,-89.8858795,14.8652666
-12.3083312,-89.7775553,14.8769488
-12.1400401,-89.6695305,14.8885283
-11.9715152,-89.5617822,14.9000060
-11.8028210,-89.4543654,14.9113829
-11.6339240,-89.3472725,14.9226600
-11.4647915,-89.2404959,14.9338382
-11.2954664,-89.1340762,14.9449185
-11.1259161,-89.0280058,14.9559017
-10.9561298,-88.9222911,14.9667890
-10.7861241,-88.8169558,14.9775811
-10.6158764,-88.7119989,14.9882789
-10.4453913,-88.6074368,14.9988834
-10.2746565,-88.5032754,15.0000000
-10.1036679,-88.3995263,15.0000000
-9.9324376,-88.2962109,15.0000000
-9.7609256,-88.1933194,15.0000000
-9.5891515,-88.0908786,15.0000000
-9.4171261,-87.9889098,15.0000000
-9.2447890,-87.8873928,15.0000000
-9.0721831,-87.7863694,15.0000000
-8.8993083,-87.6858542,15.0000000
-8.7260976,-87.5858246,15.0000000
-8.5525900,-87.4863272,15.0000000
-8.3788467,-87.3873590,15.0000000
-8.2047876,-87.2887716,15.0000000
-8.0305859,-87.1905359,15.0000000
-7.8562891,-87.0925498,15.0000000
-7.6818436,-86.9946577,15.0000000
-7.5074117,-86.8968234,15.0000000
-7.3330487,-86.7989500,15.0000000
-7.1587027,-86.7008803,15.0000000
-6.9845347,-86.6025758,15.0000000
-6.8106021,-86.5039395,15.0000000
-6.6368558,-86.4048131,15.0000000
-6.4634588,-86.3051578,15.0000000
-6.2904675,-86.2048743,15.0000000
-6.1178498,-86.1038103,15.0000000
-5.9457600,-86.0019214,15.0000000
-5.7742508,-85.8991043,15.0000000
-5.6033311,-85.7952284,15.0000000
-5.4331278,-85.6902339,15.0000000
-5.2636818,-85.5840110,15.0000000
-5.0950726,-85.4764740,15.0000000
-4.9273971,-85.3675454,15.0000000
-4.7606298,-85.2570918,15.0000000
-4.5949608,-85.1451931,15.0000000
-4.4302206,-85.0318384,15.0000000
-4.2663131,-84.9170738,15.0000000
-4.1034330,-84.8011362,15.0000000
-3.9413560,-84.6839703,15.0000000
-3.7800297,-84.5656363,15.0000000
-3.6195814,-84.4463233,15.0000000
-3.4598247,-84.3259869,15.0000000
-3.3007446,-84.2047054,15.0000000
-3.1423755,-84.0825937,15.0000000
-2.9846041,-83.9596511,15.0000000
-2.8274415,-83.8359719,15.0000000
-2.6708033,-83.7115738,15.0000000
-2.5146861,-83.5865386,15.0000000
-2.3590987,-83.4609584,15.0000000
-2.2038467,-83.3347613,15.0000000
-2.0490399,-83.2081225,15.0000000
-1.8946570,-83.0811144,15.0000000
-1.7404356,-82.9536117,15.0000000
-1.5865675,-82.8258607,15.0000000
-1.4329890,-82.6979109,15.0000000
-1.2794443,-82.5696463,15.0000000
-1.1261432,-82.4412453,15.0000000
-0.9730556,-82.3126411,15.0000000
-0.8201029,-82.1837055,15.0000000
-0.6674441,-82.0545132,15.0000000
-0.5150935,-81.9250181,15.0000000
-0.3629893,-81.7951068,15.0000000
-0.2112550,-81.6648237,15.0000000
-0.0599143,-81.5341279,15.0000000
0.0910631,-81.4029311,15.0000000
0.2415878,-81.2712482,15.0000000
0.3916272,-81.1390448,15.0000000
0.5411886,-81.0062512,15.0000000
0.6902060,-80.8728622,15.0000000
0.8386407,-80.7388489,15.0000000
0.9864841,-80.6041547,15.0000000
1.1336849,-80.4687619,15.0000000
1.2802002,-80.3326459,15.0000000
1.4260109,-80.1957595,15.0000000
1.5710745,-80.0580780,15.0000000
1.7153449,-79.9195805,15.0000000
1.8587959,-79.7802270,15.0000000
2.0013906,-79.6399885,15.0000000
2.1430795,-79.4988484,15.0000000
2.2838316,-79.3567728,15.0000000
2.4236145,-79.2137294,15.0000000
2.5623762,-79.0697084,15.0000000
2.7000824,-78.9246827,15.0000000
2.8367073,-78.7786170,15.0000000
2.9721942,-78.6315094,15.0000000
3.1065103,-78.4833438,15.0000000
3.2396547,-78.3340955,15.0000000
3.3716168,-78.1838170,15.0000000
3.5024249,-78.0325487,15.0000000
3.6321368,-77.8803085,15.0000000
3.7607657,-77.7271670,15.0000000
3.8883501,-77.5731658,15.0000000
4.0149424,-77.4183292,15.0000000
4.1405670,-77.2627155,15.0000000
4.2652656,-77.1063623,15.0000000
4.3890828,-76.9493029,15.0000000
4.5120482,-76.7915893,15.0000000
4.6342098,-76.6332505,15.0000000
4.7555972,-76.4743150,15.0000000
4.8761980,-76.3148142,15.0000000
4.9960570,-76.1546940,15.0000000
5.1151384,-75.9940047,15.0000000
5.2334166,-75.8327839,15.0000000
5.3509516,-75.6709504,15.0000000
5.4677121,-75.5085462,15.0000000
5.5836455,-75.3456441,15.0000000
5.6988308,-75.1821314,15.0000000
5.8132395,-75.0180444,15.0000000
5.9267980,-74.8534868,15.0000000
6.0395984,-74.6883219,15.0000000
6.1516149,-74.5225820,15.0000000
6.2627628,-74.3563897,15.0000000
6.3731391,-74.1895962,15.0000000
6.4827189,-74.0222330,15.0000000
6.5914179,-73.8544258,15.0000000
6.6993292,-73.6860268,15.0000000
6.8064275,-73.5170702,15.0000000
6.9126387,-73.3476691,15.0000000
7.0180446,-73.1776896,15.0000000
7.1226185,-73.0071695,15.0000000
7.2263034,-72.8361983,15.0000000
7.3291642,-72.6646657,15.0000000
7.4311737,-72.4926122,15.0000000
7.5322946,-72.3200978,15.0000000
7.6325719,-72.1470422,15.0000000
7.7319801,-71.9734853,15.0000000
7.8304997,-71.7994579,15.0000000
7.9281561,-71.6249120,15.0000000
8.0249282,-71.4498813,15.0000000
8.1208099,-71.2743738,15.0000000
8.2158087,-71.0983718,15.0000000
8.3099111,-70.9218971,15.0000000
8.4031179,-70.7449440,15.0000000
8.4954225,-70.5675214,15.0000000
8.5868212,-70.3896324,15.0000000
8.6773155,-70.2112694,15.0000000
8.7668886,-70.0324614,15.0000000
8.8555481,-69.8531883,15.0000000
8.9432908,-69.6734510,15.0000000
9.0300933,-69.4932926,15.0000000
9.1159753,-69.3126665,15.0000000
9.2009231,-69.1315939,15.0000000
9.2849183,-68.9501182,15.0000000
9.3679932,-68.7681788,15.0000000
9.4501345,-68.5858158,15.0000000
9.5313271,-68.4030740,15.0000000
9.6116086,-68.2198796,15.0000000
9.6909595,-68.0362868,15.0000000
9.7693670,-67.8523369,15.0000000
9.8468709,-67.6679467,15.0000000
9.9234479,-67.4831812,15.0000000
9.9990873,-67.2980778,15.0000000
10.0738288,-67.1125498,15.0000000
10.1476481,-66.9266669,15.0000000
10.2205365,-66.7404624,15.0000000
10.2925309,-66.5538532,15.0000000
10.3636083,-66.3669060,15.0000000
10.4337475,-66.1796459,15.0000000
10.5029333,-65.9919831,15.0000000
10.5710370,-65.8039370,15.0000000
10.6379219,-65.6154826,15.0000000
10.7034634,-65.4265255,15.0000000
10.7674867,-65.2371027,15.0000000
10.8299090,-65.0471070,15.0000000
10.8906602,-64.8565988,15.0000000
10.9497789,-64.6655813,15.0000000
11.0073217,-64.4739733,15.0000000
11.0632456,-64.2819862,15.0000000
11.1175995,-64.0895450,15.0000000
11.1704214,-63.8965892,15.0000000
11.2216801,-63.7033008,15.0000000
11.2714143,-63.5095998,15.0000000
11.3196446,-63.3154577,15.0000000
11.3663478,-63.1210133,15.0000000
11.4115507,-62.9261931,15.0000000
11.4552579,-62.7310013,15.0000000
11.4974543,-62.5355203,15.0000000
11.5381510,-62.3397032,15.0000000
11.5773405,-62.1435749,15.0000000
11.6150127,-61.9471604,15.0000000
11.6511609,-61.7504543,15.0000000
11.6857691,-61.5534813,15.0000000
11.7188248,-61.3562306,15.0000000
11.7503041,-61.1587317,15.0000000
11.7801842,-60.9609871,15.0000000
