11.7384958,-60.9594729,15.0000000
11.7628641,-60.7609969,15.0000000
11.7856024,-60.5623261,15.0000000
11.8067005,-60.3634732,15.0000000
11.8261477,-60.1644547,15.0000000
11.8439340,-59.9652796,15.0000000
11.8600489,-59.7659610,15.0000000
11.8744810,-59.5665161,15.0000000
11.8872196,-59.3669546,15.0000000
11.8982531,-59.1672903,15.0000000
11.9075696,-58.9675411,15.0000000
11.9151571,-58.7677175,15.0000000
11.9210032,-58.5678340,15.0000000
11.9250949,-58.3679095,15.0000000
11.9274191,-58.1679554,15.0000000
11.9279626,-57.9679872,15.0000000
11.9267115,-57.7680248,15.0000000
11.9236519,-57.5680806,15.0000000
11.9187700,-57.3681714,15.0000000
11.9120491,-57.1683179,15.0000000
11.9034577,-56.9685345,15.0000000
11.8929462,-56.7688429,15.0000000
11.8804633,-56.5692651,15.0000000
11.8660087,-56.3698200,15.0000000
11.8496113,-56.1705269,15.0000000
11.8313142,-55.9713963,15.0000000
11.8111556,-55.7724468,15.0000000
11.7891748,-55.5736935,15.0000000
11.7654120,-55.3751395,15.0000000
11.7399077,-55.1768044,15.0000000
11.7127017,-54.9786999,15.0000000
11.6838323,-54.7808228,15.0000000
11.6533406,-54.5831930,15.0000000
11.6212663,-54.3858191,15.0000000
11.5876466,-54.1886927,15.0000000
11.5525233,-53.9918334,15.0000000
11.5159364,-53.7952464,15.0000000
11.4779229,-53.5989196,15.0000000
11.4385259,-53.4028708,15.0000000
11.3977862,-53.2071024,15.0000000
11.3557416,-53.0115992,15.0000000
11.3124367,-52.8163765,15.0000000
11.2679142,-52.6214334,15.0000000
11.2222134,-52.4267534,15.0000000
11.1753763,-52.2323491,15.0000000
11.1274324,-52.0382169,15.0000000
11.0784037,-51.8443506,15.0000000
11.0283152,-51.6507578,15.0000000
10.9771906,-51.4574371,15.0000000
10.9250534,-51.2643849,15.0000000
10.8719283,-51.0716033,15.0000000
10.8178390,-50.8790897,15.0000000
10.7628095,-50.6868430,15.0000000
10.7068634,-50.4948612,15.0000000
10.6500239,-50.3031404,15.0000000
10.5923153,-50.1116818,15.0000000
10.5337598,-49.9204798,15.0000000
10.4743796,-49.7295295,15.0000000
10.4141991,-49.5388343,15.0000000
10.3532388,-49.3483854,15.0000000
10.2915197,-49.1581772,15.0000000
10.2290660,-48.9682149,15.0000000
10.1658964,-48.7784874,15.0000000
10.1020307,-48.5889885,15.0000000
10.0374926,-48.3997247,15.0000000
9.9722987,-48.2106833,15.0000000
9.9064657,-48.0218582,15.0000000
9.8400136,-47.8332582,15.0000000
9.7729525,-47.6448708,15.0000000
9.7052949,-47.4566916,15.0000000
9.6370578,-47.2687297,15.0000000
9.5682500,-47.0809730,15.0000000
9.4988833,-46.8934175,15.0000000
9.4289730,-46.7060710,15.0000000
9.3585273,-46.5189223,15.0000000
9.2875571,-46.3319684,15.0000000
9.2160762,-46.1452147,15.0000000
9.1440922,-45.9586521,15.0000000
9.0716154,-45.7722781,15.0000000
8.9986574,-45.5860957,15.0000000
8.9252260,-45.4000978,15.0000000
8.8513306,-45.2142826,15.0000000
8.7769829,-45.0286500,15.0000000
8.7021970,-44.8431925,15.0000000
8.6269941,-44.6579035,15.0000000
8.5513993,-44.4727749,15.0000000
8.4754378,-44.2877961,15.0000000
8.3991355,-44.1029573,15.0000000
8.3225192,-43.9182490,15.0000000
8.2456167,-43.7336594,15.0000000
8.1684561,-43.5491774,15.0000000
8.0910657,-43.3647920,15.0000000
8.0134733,-43.1804913,15.0000000
7.9357069,-42.9962639,15.0000000
7.8577945,-42.8120984,15.0000000
7.7797639,-42.6279829,15.0000000
7.7016415,-42.4439062,15.0000000
7.6234520,-42.2598582,15.0000000
7.5452162,-42.0758297,15.0000000
7.4669550,-41.8918120,15.0000000
7.3886897,-41.7077961,15.0000000
7.3104422,-41.5237727,15.0000000
7.2322344,-41.3397322,15.0000000
7.1540885,-41.1556657,15.0000000
7.0760262,-40.9715636,15.0000000
6.9980695,-40.7874167,15.0000000
6.9202405,-40.6032158,15.0000000
6.8425612,-40.4189518,15.0000000
6.7650535,-40.2346155,15.0000000
6.6877395,-40.0501979,15.0000000
6.6106413,-39.8656900,15.0000000
6.5337809,-39.6810829,15.0000000
6.4571806,-39.4963677,15.0000000
6.3808624,-39.3115358,15.0000000
6.3048486,-39.1265785,15.0000000
6.2291614,-38.9414873,15.0000000
6.1538232,-38.7562538,15.0000000
6.0788564,-38.5708697,15.0000000
6.0042833,-38.3853268,15.0000000
5.9301264,-38.1996172,15.0000000
5.8564084,-38.0137330,15.0000000
5.7831520,-37.8276663,15.0000000
5.7103794,-37.6414099,15.0000000
5.6381021,-37.4549609,15.0000000
5.5663209,-37.2683201,15.0000000
5.4950310,-37.0814912,15.0000000
5.4242290,-36.8944770,15.0000000
5.3539153,-36.7072785,15.0000000
5.2840966,-36.5198949,15.0000000
5.2147791,-36.3323253,15.0000000
5.1459678,-36.1445693,15.0000000
5.0776660,-35.9566275,15.0000000
5.0098750,-35.7685008,15.0000000
4.9425951,-35.5801906,15.0000000
4.8758266,-35.3916986,15.0000000
4.8095700,-35.2030260,15.0000000
4.7438257,-35.0141743,15.0000000
4.6785941,-34.8251449,15.0000000
4.6138756,-34.6359392,15.0000000
4.5496706,-34.4465586,15.0000000
4.4859795,-34.2570045,15.0000000
4.4228028,-34.0672785,15.0000000
4.3601407,-33.8773818,15.0000000
4.2979937,-33.6873159,15.0000000
4.2363622,-33.4970823,15.0000000
4.1752464,-33.3066823,15.0000000
4.1146469,-33.1161174,15.0000000
4.0545640,-32.9253890,15.0000000
3.9949980,-32.7344985,15.0000000
3.9359494,-32.5434474,15.0000000
3.8774184,-32.3522370,15.0000000
3.8194055,-32.1608688,15.0000000
3.7619111,-31.9693442,15.0000000
3.7049354,-31.7776646,15.0000000
3.6484790,-31.5858315,15.0000000
3.5925421,-31.3938462,15.0000000
3.5371252,-31.2017102,15.0000000
3.4822285,-31.0094248,15.0000000
3.4278526,-30.8169916,15.0000000
3.3739977,-30.6244120,15.0000000
3.3206642,-30.4316872,15.0000000
3.2678526,-30.2388188,15.0000000
3.2155632,-30.0458082,15.0000000
3.1637963,-29.8526567,15.0000000
3.1125525,-29.6593659,15.0000000
3.0618320,-29.4659371,15.0000000
3.0116352,-29.2723716,15.0000000
2.9619626,-29.0786710,15.0000000
2.9128145,-28.8848368,15.0000000
2.8641912,-28.6908700,15.0000000
2.8160933,-28.4967724,15.0000000
2.7685211,-28.3025454,15.0000000
2.7214750,-28.1081901,15.0000000
2.6749555,-27.9137081,15.0000000
2.6289625,-27.7191012,15.0000000
2.5834951,-27.5243704,15.0000000
2.5385522,-27.3295181,15.0000000
2.4941324,-27.1345460,15.0000000
2.4502343,-26.9394556,15.0000000
2.4068567,-26.7442488,15.0000000
2.3639983,-26.5489276,15.0000000
2.3216575,-26.3534932,15.0000000
2.2798333,-26.1579477,15.0000000
2.2385242,-25.9622930,14.9932635
2.1977288,-25.7665302,14.8117291
2.1574457,-25.5706615,14.6283329
2.1176738,-25.3746885,14.4430090
2.0784113,-25.1786125,14.2556869
2.0396572,-24.9824355,14.0662917
2.0014098,-24.7861592,13.8747436
1.9636678,-24.5897850,13.6809569
1.9264298,-24.3933146,13.4848402
1.8896943,-24.1967497,13.2862955
1.8534599,-24.0000917,13.0852172
1.8177250,-23.8033424,12.8814919
1.7824882,-23.6065033,12.6749974
1.7477480,-23.4095759,12.4656013
1.7135029,-23.2125619,12.2531603
1.6797513,-23.0154625,12.0375190
1.6464918,-22.8182798,11.8185080
1.6137228,-22.6210149,11.5959411
1.5814426,-22.4236691,11.3696159
1.5496499,-22.2262447,11.1393160
1.5183429,-22.0287425,10.9047780
1.4875199,-21.8311637,10.6657283
1.4571795,-21.6335110,10.4219527
1.4273209,-21.4357848,10.1729319
1.3979404,-21.2379862,9.9182485
1.3690359,-21.0401186,9.6581440
1.3406194,-20.8421796,9.3960147
1.3127792,-20.6441590,9.1332134
1.2856373,-20.4460446,8.8646498
1.2592692,-20.2478292,8.6053949
1.2340625,-20.0494493,8.3652237
1.2106995,-19.8508590,8.1490879
1.1899642,-19.6519752,7.9496490
1.1725246,-19.4527603,7.7621059
1.1589566,-19.2532652,7.5873268
1.1498577,-19.0535086,7.4242612
1.1458230,-18.8535764,7.2718281
1.1474160,-18.6536251,7.1262248
1.1551284,-18.4538053,6.9855641
1.1693985,-18.2543556,6.8483951
1.1906232,-18.0555144,6.7126809
1.2191589,-17.8575876,6.5778041
1.2553354,-17.6609569,6.4433311
1.2995021,-17.4659139,6.3096586
1.3519843,-17.2729683,6.1770610
1.4131206,-17.0826293,6.0459507
1.4833034,-16.8953893,5.9201407
1.5629298,-16.7120013,5.8006939
1.6524364,-16.5332198,5.6890817
1.7522280,-16.3599806,5.5904228
1.8627251,-16.1933716,5.5068335
1.9842859,-16.0346164,5.4421613
2.1171068,-15.8852064,5.4058085
2.2613507,-15.7467593,5.3842604
2.4165265,-15.6207316,5.3670111
2.5814748,-15.5077665,5.3454458
2.7541178,-15.4069233,5.3893943
2.9326463,-15.3169245,5.4797789
3.1155757,-15.2361904,5.6091461
3.3013776,-15.1623065,5.7732011
3.4887843,-15.0925621,5.9314589
3.6766984,-15.0242551,6.0843819
3.8642596,-14.9549241,6.0751237
4.0506846,-14.8824864,5.7971718
4.2351296,-14.8051951,5.5434419
4.4167552,-14.7214280,5.3127938
4.5943424,-14.6296893,5.1057244
4.7666909,-14.5282882,4.9331949
4.9317749,-14.4156140,4.8036926
5.0872444,-14.2899931,4.7252427
5.2301653,-14.1503462,4.6860672
5.3577515,-13.9965371,4.6646024
5.4677958,-13.8295560,4.6460088
5.5588327,-13.6516300,4.6273406
5.6312160,-13.4652316,4.6536908
5.6854916,-13.2728643,4.7068189
5.7224809,-13.0763554,4.7776334
5.7432852,-12.8774819,4.8691963
5.7492125,-12.6777273,4.9782277
5.7416528,-12.4778795,5.1031271
5.7219453,-12.2789322,5.2404625
5.6912985,-12.0814136,5.3860610
5.6507419,-11.8856274,5.5375934
5.6011566,-11.6919669,5.6898804
5.5432393,-11.5005593,5.8411935
5.4776479,-11.3116956,5.9907087
5.4049304,-11.1254406,6.1380008
5.3256302,-10.9418319,6.2843105
5.2403639,-10.7609761,6.4261565
5.1497150,-10.5827387,6.5638370
5.0543377,-10.4069655,6.6976176
4.9549584,-10.2334492,6.8277360
4.8523384,-10.0618266,6.9544058
4.7472362,-9.8916972,7.0778203
4.6403075,-9.7227227,7.1981548
4.5319121,-9.5546770,7.3155687
4.4223245,-9.3874089,7.4302081
4.3118534,-9.2207256,7.5422067
4.2009793,-9.0543101,7.6516875
4.0899905,-8.8879705,7.7587641
3.9789741,-8.7216496,7.8635416
3.8678746,-8.5553843,7.9661172
3.7566450,-8.3892056,8.0665816
3.6452667,-8.2231268,8.1650190
3.5337401,-8.0571476,8.2615082
3.4220749,-7.8912615,8.3561228
3.3102892,-7.7254566,8.4489318
3.1984097,-7.5597150,8.5400000
3.0864511,-7.3940268,8.6293884
2.9744162,-7.2283902,8.7171543
2.8623003,-7.0628085,8.8033518
2.7500976,-6.8972854,8.8880322
2.6378028,-6.7318249,8.9712437
2.5254101,-6.5664308,9.0530322
2.4129139,-6.4011071,9.1334412
2.3003083,-6.2358580,9.2125119
2.1875878,-6.0706871,9.2902836
2.0747498,-5.9055966,9.3667935
1.9617942,-5.7405865,9.4420774
1.8487233,-5.5756554,9.5161690
1.7355397,-5.4108015,9.5891008
1.6222459,-5.2460235,9.6609038
1.5088438,-5.0813199,9.7316074
1.3953357,-4.9166893,9.8012401
1.2817238,-4.7521304,9.8698290
1.1680104,-4.5876416,9.9374001
1.0541976,-4.4232215,10.0039783
0.9402877,-4.2588687,10.0695876
0.8262828,-4.0945818,10.1342511
0.7121852,-3.9303593,10.1979910
0.5979969,-3.7661997,10.2608284
0.4837203,-3.6021017,10.3227839
0.3693573,-3.4380639,10.3838773
0.2549103,-3.2740847,10.4441277
0.1403813,-3.1101627,10.5035534
0.0257725,-2.9462965,10.5621722
-0.0889140,-2.7824846,10.6200012
-0.2036759,-2.6187256,10.6770569
-0.3185112,-2.4550181,10.7333554
-0.4334178,-2.2913606,10.7889121
-0.5483935,-2.1277516,10.8437421
-0.6634361,-1.9641897,10.8978597
-0.7785437,-1.8006734,10.9512791
-0.8937139,-1.6372014,11.0040138
-1.0089448,-1.4737720,11.0560771
-1.1242342,-1.3103840,11.1074818
-1.2395801,-1.1470357,11.1582402
-1.3549802,-0.9837258,11.2083644
-1.4704325,-0.8204528,11.2578661
-1.5859349,-0.6572153,11.3067567
-1.7014853,-0.4940117,11.3550472
-1.8170816,-0.3308406,11.4027483
-1.9327216,-0.1677005,11.4498705
-2.0484034,-0.0045900,11.4964240
-2.1641248,0.1584924,11.5424186
-2.2798837,0.3215482,11.5878640
-2.3956780,0.4845788,11.6327695
-2.5115056,0.6475858,11.6771442
-2.6273645,0.8105705,11.7209970
-2.7432524,0.9735346,11.7643366
-2.8591675,1.1364794,11.8071715
-2.9751077,1.2994062,11.8495099
-3.0910714,1.4623165,11.8913597
-3.2070566,1.6252113,11.9327289
-3.3230618,1.7880919,11.9736251
-3.4390852,1.9509597,12.0140558
-3.5551249,2.1138157,12.0540282
-3.6711793,2.2766613,12.0935495
-3.7872465,2.4394977,12.1326266
-3.9033249,2.6023262,12.1712664
-4.0194126,2.7651480,12.2094755
-4.1355080,2.9279644,12.2472604
-4.2516092,3.0907766,12.2846273
-4.3677146,3.2535858,12.3215827
-4.4838223,3.4163934,12.3581325
-4.5999306,3.5792006,12.3942826
-4.7160378,3.7420085,12.4300390
-4.8321420,3.9048186,12.4654072
-4.9482416,4.0676319,12.5003930
-5.0643348,4.2304499,12.5350016
-5.1804199,4.3932736,12.5692386
-5.2964949,4.5561044,12.6031090
-5.4125584,4.7189436,12.6366182
-5.5286084,4.8817923,12.6697710
-5.6446432,5.0446518,12.7025724
-5.7606611,5.2075234,12.7350273
-5.8766603,5.3704084,12.7671404
-5.9926390,5.5333078,12.7989164
-6.1085955,5.6962231,12.8303597
-6.2245281,5.8591555,12.8614749
-6.3404350,6.0221061,12.8922664
-6.4563143,6.1850762,12.9227384
-6.5721645,6.3480672,12.9528952
-6.6879837,6.5110802,12.9827410
-6.8037701,6.6741164,13.0122797
-6.9195220,6.8371772,13.0415155
-7.0352376,7.0002636,13.0704521
-7.1509152,7.1633771,13.0990935
-7.2665530,7.3265188,13.1274435
-7.3821493,7.4896899,13.1555058
-7.4977022,7.6528917,13.1832839
-7.6132101,7.8161254,13.2107816
-7.7286711,7.9793922,13.2380023
-7.8440835,8.1426934,13.2649495
-7.9594455,8.3060302,13.2916266
-8.0747554,8.4694038,13.3180370
-8.1900114,8.6328154,13.3441839
-8.3052117,8.7962664,13.3700706
-8.4203546,8.9597577,13.3957002
-8.5354382,9.1232908,13.4210759
-8.6504609,9.2868668,13.4462008
-8.7654208,9.4504868,13.4710779
-8.8803161,9.6141522,13.4957102
-8.9951452,9.7778642,13.5201006
-9.1099062,9.9416239,13.5442520
-9.2245972,10.1054324,13.5681672
-9.3392167,10.2692912,13.5918490
-9.4537627,10.4332013,13.6153002
-9.5682335,10.5971639,13.6385235
-9.6826273,10.7611803,13.6615215
-9.7969424,10.9252515,13.6842969
-9.9111768,11.0893789,13.7068522
-10.0253290,11.2535636,13.7291900
-10.1393969,11.4178067,13.7513129
-10.2533790,11.5821094,13.7732232
-10.3672733,11.7464731,13.7949233
-10.4810781,11.9108987,13.8164158
-10.5947916,12.0753874,13.8377029
-10.7084119,12.2399405,13.8587870
-10.8219374,12.4045591,13.8796704
-10.9353661,12.5692444,13.9003552
-11.0486963,12.7339975,13.9208438
-11.1619261,12.8988195,13.9411384
-11.2750538,13.0637117,13.9612410
-11.3880776,13.2286751,13.9811538
-11.5009955,13.3937110,14.0008790
-11.6138059,13.5588204,14.0204185
-11.7265069,13.7240046,14.0397745
-11.8390967,13.8892645,14.0589489
-11.9515734,14.0546014,14.0779437
-12.0639353,14.2200164,14.0967609
-12.1761804,14.3855106,14.1154024
-12.2883070,14.5510852,14.1338700
-12.4003133,14.7167412,14.1521658
-12.5121973,14.8824797,14.1702915
-12.6239573,15.0483020,14.1882489
-12.7355913,15.2142090,14.2060399
-12.8470978,15.3802018,14.2236662
-12.9584757,15.5462809,14.2411296
-13.0697244,15.7124466,14.2584318
-13.1808439,15.8786988,14.2755746
-13.2918337,16.0450375,14.2925595
-13.4026935,16.2114629,14.2129455
-13.5134231,16.3779749,13.9980081
-13.6240222,16.5445737,13.7811471
-13.7344905,16.7112592,13.5622595
-13.8448276,16.8780316,13.3412349
-13.9550334,17.0448909,13.1179535
-14.0651074,17.2118369,12.8922866
-14.1750496,17.3788700,12.6640948
-14.2848596,17.5459900,12.4332296
-14.3945371,17.7131968,12.1995265
-14.5040821,17.8804906,11.9627978
-14.6134942,18.0478714,11.7228658
-14.7227732,18.2153389,11.4795207
-14.8319189,18.3828935,11.2325080
-14.9409313,18.5505349,10.9814581
-15.0498117,18.7182618,10.7261217
-15.1585609,18.8860740,10.4665669
-15.2671747,19.0539739,10.2020970
-15.3756532,19.2219610,9.9323803
-15.4839936,19.3900373,9.6579522
-15.5921818,19.5582120,9.3768755
-15.7002225,19.7264807,9.0871082
-15.8081605,19.8948153,8.7876661
-15.9160634,20.0631672,8.4942297
-16.0236060,20.2317525,8.2178583
-16.1302660,20.4008907,7.9469150
-16.2356625,20.5707942,7.6856269
-16.3393681,20.7417903,7.4370923
-16.4407250,20.9141467,7.2096620
-16.5389352,21.0883224,7.0065494
-16.6330470,21.2647932,6.8286483
-16.7219741,21.4438794,6.6731129
-16.8047131,21.6259040,6.5348116
-16.8803380,21.8110284,6.4100742
-16.9479903,21.9991727,6.2921041
-17.0069973,22.1902258,6.1734547
-17.0568567,22.3838887,6.0527790
-17.0972316,22.5797435,5.9270837
-17.1279385,22.7773794,5.7886630
-17.1487191,22.9761793,5.6387992
-17.1592416,23.1758964,5.4779859
-17.1589509,23.3758082,5.3148249
-17.1471141,23.5753458,5.1527848
-17.1227962,23.7737709,5.0002524
-17.0848497,23.9700243,4.8608784
-17.0319870,24.1628782,4.7399875
-16.9629277,24.3504549,4.6499852
-16.8762838,24.5306505,4.5930106
-16.7712043,24.7006603,4.5747024
-16.6475045,24.8578076,4.5563207
-16.5066778,24.9997704,4.5417657
-16.3517088,25.1256692,4.5643702
-16.1853537,25.2365837,4.6429421
-16.0104777,25.3330767,4.7520741
-15.8282642,25.4154804,4.8594654
-15.6402100,25.4831422,4.9461623
-15.4473666,25.5360028,5.0256693
-15.2510592,25.5741854,5.1035313
-15.0525652,25.5980905,5.1831998
-14.8528624,25.6083744,5.2699237
-14.6529487,25.6059227,5.3675401
-14.4534678,25.5918491,5.4788131
-14.2549710,25.5674750,5.6097203
-14.0578652,25.5342412,5.7612752
-13.8620798,25.4935345,5.9199450
-13.6677547,25.4466567,6.0732480
-13.4747126,25.3945887,6.2215905
-13.2829291,25.3380953,6.3653286
-13.0923704,25.2776884,6.5047765
-12.9028457,25.2136391,6.6402133
-12.7146045,25.1461974,6.7718882
-12.5275759,25.0753376,6.9000249
-12.3418780,25.0010930,7.0248250
-12.1575079,24.9236700,7.1464713
-11.9742400,24.8436846,7.2651298
-11.7917116,24.7620135,7.3809523
-11.6095891,24.6794372,7.4940774
-11.4277528,24.5962315,7.6046328
-11.2461877,24.5124401,7.7127360
-11.0649092,24.4280278,7.8184956
-10.8839157,24.3430054,7.9220122
-10.7032062,24.2573835,8.0233791
-10.5227795,24.1711656,8.1226832
-10.3426386,24.0843519,8.2200058
-10.1627852,23.9969456,8.3154225
-9.9832187,23.9089503,8.4090044
-9.8039406,23.8203687,8.5008179
-9.6249523,23.7312041,8.5909256
-9.4462539,23.6414589,8.6793865
-9.2678466,23.5511365,8.7662560
-9.0897316,23.4602398,8.8515865
-8.9119091,23.3687715,8.9354276
-8.7343801,23.2767347,9.0178262
-8.5571457,23.1841324,9.0988267
-8.3802063,23.0909674,9.1784713
-8.2035627,22.9972427,9.2568002
-8.0272158,22.9029612,9.3338515
-7.8511660,22.8081258,9.4096614
-7.6754142,22.7127393,9.4842647
-7.4999611,22.6168047,9.5576943
-7.3248071,22.5203248,9.6299818
-7.1499531,22.4233025,9.7011574
-6.9753995,22.3257407,9.7712500
-6.8011469,22.2276422,9.8402871
-6.6271960,22.1290098,9.9082953
-6.4535472,22.0298464,9.9753000
-6.2802012,21.9301548,10.0413256
-6.1071584,21.8299378,10.1063954
-5.9344192,21.7291981,10.1705321
-5.7619844,21.6279386,10.2337573
-5.5898542,21.5261622,10.2960918
-5.4180290,21.4238713,10.3575558
-5.2465095,21.3210689,10.4181685
-5.0752960,21.2177578,10.4779487
-4.9043888,21.1139405,10.5369144
-4.7337884,21.0096199,10.5950830
-4.5634953,20.9047988,10.6524712
-4.3935094,20.7994795,10.7090953
-4.2238316,20.6936650,10.7649710
-4.0544621,20.5873579,10.8201135
-3.8854009,20.4805607,10.8745375
-3.7166486,20.3732763,10.9282572
-3.5482056,20.2655073,10.9812865
-3.3800717,20.1572560,11.0336386
-3.2122476,20.0485253,11.0853266
-3.0447336,19.9393178,11.1363630
-2.8775295,19.8296359,11.1867601
-2.7106360,19.7194823,11.2365297
-2.5440531,19.6088596,11.2856832
-2.3777809,19.4977700,11.3342319
-2.2118198,19.3862164,11.3821867
-2.0461701,19.2742013,11.4295581
-1.8808314,19.1617269,11.4763564
-1.7158045,19.0487960,11.5225915
-1.5510894,18.9354111,11.5682733
-1.3866858,18.8215742,11.6134112
-1.2225944,18.7072883,11.6580144
-1.0588151,18.5925556,11.7020919
-0.8953478,18.4773784,11.7456524
-0.7321929,18.3617594,11.7887046
-0.5693505,18.2457009,11.8312567
-0.4068203,18.1292050,11.8733169
-0.2446028,18.0122745,11.9148930
-0.0826978,17.8949117,11.9559929
0.0788947,17.7771186,11.9966240
0.2401744,17.6588979,12.0367938
0.4011414,17.5402519,12.0765094
0.5617959,17.4211828,12.1157778
0.7221376,17.3016929,12.1546059
0.8821666,17.1817847,12.1930005
1.0418830,17.0614602,12.2309681
1.2012867,16.9407219,12.2685150
1.3603778,16.8195720,12.3056477
1.5191565,16.6980127,12.3423722
1.6776225,16.5760464,12.3786945
1.8357762,16.4536752,12.4146205
1.9936175,16.3309013,12.4501559
2.1511466,16.2077271,12.4853064
2.3083635,16.0841548,12.5200775
2.4652683,15.9601864,12.5544746
2.6218613,15.8358243,12.5885029
2.7781425,15.7110706,12.6221677
2.9341120,15.5859275,12.6554741
3.0897701,15.4603972,12.6884269
3.2451168,15.3344817,12.7210311
3.4001523,15.2081833,12.7532915
3.5548773,15.0815047,12.7852127
3.7092930,14.9544493,12.8167994
3.8634011,14.8270210,12.8480560
4.0172036,14.6992239,12.8789869
4.1707023,14.5710621,12.9095966
4.3238992,14.4425398,12.9398893
4.4767963,14.3136609,12.9698690
4.6293955,14.1844293,12.9995401
4.7816987,14.0548492,13.0289064
4.9337082,13.9249246,13.0579720
5.0854259,13.7946593,13.0867406
5.2368541,13.6640577,13.1152162
5.3879956,13.5331244,13.1434024
5.5388537,13.4018645,13.1713031
5.6894321,13.2702842,13.1989216
5.8397358,13.1383898,13.2262617
5.9897692,13.0061881,13.2533268
6.1395365,12.8736852,13.2801203
6.2890417,12.7408866,13.3066456
6.4382891,12.6077981,13.3329061
6.5872828,12.4744260,13.3589050
6.7360274,12.3407758,13.3846454
6.8845269,12.2068535,13.4101306
7.0327858,12.0726649,13.4353636
7.1808085,11.9382157,13.4603475
7.3285995,11.8035118,13.4850853
7.4761630,11.6685589,13.5095800
7.6235038,11.5333627,13.5338344
7.7706262,11.3979290,13.5578514
7.9175347,11.2622634,13.5816338
8.0642341,11.1263715,13.6051845
8.2107289,10.9902591,13.6285060
8.3570236,10.8539317,13.6516011
8.5031230,10.7173950,13.6744725
8.6490317,10.5806546,13.6971227
8.7947544,10.4437160,13.7195543
8.9402959,10.3065847,13.7417698
9.0856609,10.1692664,13.7637717
9.2308541,10.0317665,13.7855625
9.3758804,9.8940905,13.8071445
9.5207445,9.7562439,13.8285202
9.6654513,9.6182321,13.8496918
9.8100057,9.4800607,13.8706617
9.9544124,9.3417350,13.8914322
10.0986764,9.2032605,13.9120054
10.2428026,9.0646425,13.9323836
10.3867959,8.9258864,13.9525690
10.5306612,8.7869977,13.9725636
10.6744034,8.6479816,13.9923697
10.8180276,8.5088435,14.0119893
10.9615386,8.3695888,14.0314244
11.1049416,8.2302227,14.0506771
11.2482413,8.0907506,14.0697494
11.3914430,7.9511777,14.0886431
11.5345516,7.8115093,14.1073604
11.6775720,7.6717508,14.1259030
11.8205095,7.5319073,14.1442729
11.9633689,7.3919842,14.1624719
12.1061554,7.2519866,14.1805019
12.2488740,7.1119198,14.1983647
12.3915298,6.9717890,14.2160620
12.5341278,6.8315994,14.2335957
12.6766732,6.6913563,14.2509674
12.8191710,6.5510649,14.2681789
12.9616263,6.4107303,14.2852319
13.1040442,6.2703578,14.3021280
13.2464298,6.1299525,14.3188689
13.3887882,5.9895196,14.3354563
13.5311245,5.8490644,14.3518916
13.6734439,5.7085919,14.3681766
13.8157513,5.5681074,14.3843127
13.9580520,5.4276160,14.4003016
14.1003511,5.2871230,14.4161447
14.2426536,5.1466335,14.4318436
14.3849646,5.0061526,14.4473997
14.5272894,4.8656856,14.4628145
14.6696329,4.7252376,14.4780895
14.8120003,4.5848138,14.4932261
14.9543967,4.4444195,14.5082256
15.0968272,4.3040597,14.5230896
15.2392969,4.1637398,14.5378193
15.3818109,4.0234648,14.5524162
15.5243743,3.8832400,14.5668815
15.6669922,3.7430707,14.5812167
15.8096697,3.6029620,14.5954229
15.9524120,3.4629193,14.6095016
16.0952239,3.3229477,14.6234540
16.2381103,3.1830520,14.6372814
16.3810753,3.0432366,14.6509849
16.5241228,2.9035058,14.6645659
16.6672568,2.7638635,14.6780256
16.8104811,2.6243137,14.6913651
16.9537995,2.4848608,14.7045857
17.0972160,2.3455087,14.7176885
17.2407346,2.2062615,14.7306748
17.3843589,2.0671238,14.7435455
17.5280930,1.9280992,14.7563020
17.6719407,1.7891920,14.7689453
17.8159057,1.6504068,14.7814764
17.9599920,1.5117474,14.7938966
18.1042036,1.3732180,14.8062069
18.2485438,1.2348232,14.8184084
18.3930170,1.0965668,14.8305020
18.5376269,0.9584533,14.8424890
18.6823769,0.8204871,14.8543702
18.8272713,0.6826723,14.8661468
18.9723138,0.5450131,14.8778197
19.1175078,0.4075143,14.8893900
19.2628575,0.2701797,14.9008586
19.4083666,0.1330139,14.9122265
19.5540386,-0.0039784,14.9234947
19.6998775,-0.1407933,14.9346641
19.8458871,-0.2774262,14.9457356
19.9920708,-0.4138724,14.9567103
20.1384325,-0.5501278,14.9675890
20.2849760,-0.6861879,14.9783727
20.4317048,-0.8220478,14.9890622
20.5786226,-0.9577034,14.9996584
20.7257332,-1.0931500,15.0000000
20.8730401,-1.2283830,15.0000000
21.0205469,-1.3633979,15.0000000
21.1682573,-1.4981900,15.0000000
21.3161749,-1.6327548,15.0000000
21.4643031,-1.7670876,15.0000000
21.6126454,-1.9011837,15.0000000
21.7612059,-2.0350386,15.0000000
21.9099876,-2.1686473,15.0000000
22.0589936,-2.3020054,15.0000000
22.2082274,-2.4351093,15.0000000
22.3576926,-2.5679528,15.0000000
22.5073966,-2.7005264,15.0000000
22.6573530,-2.8328162,15.0000000
22.8075761,-2.9648023,15.0000000
22.9580834,-3.0964637,15.0000000
23.1088931,-3.2277799,15.0000000
23.2600208,-3.3587292,15.0000000
23.4114823,-3.4892921,15.0000000
23.5632945,-3.6194476,15.0000000
23.7154754,-3.7491713,15.0000000
23.8680467,-3.8784359,15.0000000
24.0210189,-4.0072255,15.0000000
24.1743722,-4.1355613,15.0000000
24.3280332,-4.2635283,15.0000000
24.4818909,-4.3912587,15.0000000
24.6358445,-4.5188737,15.0000000
24.7898473,-4.6464293,15.0000000
24.9438820,-4.7739471,15.0000000
25.0979402,-4.9014361,15.0000000
25.2520113,-5.0289107,15.0000000
25.4060827,-5.1563828,15.0000000
25.5601415,-5.2838709,15.0000000
25.7141630,-5.4114040,15.0000000
25.8681025,-5.5390348,15.0000000
26.0219022,-5.6668351,15.0000000
26.1754922,-5.7948869,15.0000000
26.3288053,-5.9232706,15.0000000
26.4817762,-6.0520618,15.0000000
26.6343419,-6.1813318,15.0000000
26.7864413,-6.3111515,15.0000000
26.9380113,-6.4415884,15.0000000
27.0889898,-6.5727082,15.0000000
27.2393170,-6.7045762,15.0000000
27.3889297,-6.8372534,15.0000000
27.5377655,-6.9708002,15.0000000
27.6857632,-7.1052776,15.0000000
27.8328566,-7.2407423,14.9425464
27.9789798,-7.3772519,14.8339989
28.1240664,-7.5148649,14.7304419
28.2680448,-7.6536357,14.6319055
28.4108433,-7.7936200,14.5388972
28.5523845,-7.9348766,14.4516306
28.6925849,-8.0774630,14.3702298
28.8313620,-8.2214356,14.2924695
28.9686485,-8.3668297,14.2165818
29.1043994,-8.5136587,14.1402978
29.2385960,-8.6619116,14.0627719
29.3712206,-8.8115686,13.9837446
29.5022499,-8.9626256,13.9064770
29.6316305,-9.1150977,13.8340426
29.7592787,-9.2690205,13.7676098
29.8850968,-9.4244444,13.7077829
30.0089801,-9.5814146,13.6516734
30.1308493,-9.7399533,13.5972565
30.2506544,-9.9000579,13.5426209
30.3683802,-10.0616973,13.4899600
30.4840597,-10.2248080,13.4436345
30.5977448,-10.3893149,13.4045803
30.7094799,-10.5551519,13.3715582
30.8193126,-10.7222559,13.3445207
30.9272941,-10.8905619,13.3234746
31.0334821,-11.0600043,13.3087072
31.1379338,-11.2305240,13.2996521
31.2407036,-11.4020622,13.2959792
31.3418462,-11.5745635,13.2974414
31.4414156,-11.7479803,13.3035390
31.5394597,-11.9222628,13.3139144
31.6360254,-12.0973677,13.3281212
31.7311610,-12.2732563,13.3460080
31.8249117,-12.4498856,13.3674597
31.9173252,-12.6272176,13.3923750
32.0084501,-12.8052171,13.4177836
32.0983322,-12.9838463,13.4429410
32.1870196,-13.1630716,13.4678502
32.2745601,-13.3428607,13.4925142
32.3610010,-13.5231804,13.5169360
32.4463911,-13.7040008,13.5411183
32.5307783,-13.8852906,13.5650642
32.6142121,-14.0670213,13.5887762
32.6967425,-14.2491653,13.6122573
32.7784187,-14.4316919,13.6355102
32.8592930,-14.6145761,13.6585374
32.9394178,-14.7977912,13.6813416
33.0188439,-14.9813076,13.7039255
33.0976261,-15.1651027,13.7262915
33.1758200,-15.3491495,13.7484422
33.2534891,-15.5334165,13.7703801
33.3307066,-15.7178744,13.7921075
33.4075531,-15.9024876,13.8136269
33.4841113,-16.0872196,13.8349406
33.5604652,-16.2720368,13.8560511
33.6366974,-16.4569043,13.8769604
33.7128907,-16.6417874,13.8976710
33.7891289,-16.8266523,13.9181851
33.8654959,-17.0114640,13.9385048
33.9420757,-17.1961875,13.9586323
34.0189528,-17.3807876,13.9785697
34.0962123,-17.5652278,13.9983192
34.1739396,-17.7494716,14.0178828
34.2522189,-17.9334814,14.0372626
34.3311331,-18.1172198,14.0564606
34.4107718,-18.3006455,14.0754787
34.4912327,-18.4837118,14.0943189
34.5726228,-18.6663667,14.1129831
34.6550460,-18.8485579,14.1314734
34.7385918,-19.0302369,14.1497914
34.8233219,-19.2113662,14.1679392
34.9092570,-19.3919275,14.1859184
34.9963893,-19.5719140,14.2037310
35.0846938,-19.7513288,14.2213787
35.1741263,-19.9301842,14.2388632
35.2646356,-20.1084967,14.2561863
35.3561749,-20.2862845,14.2733497
35.4486983,-20.4635595,14.2903551
35.5421656,-20.6403395,14.3072042
35.6365370,-20.8166419,14.3238985
35.7317695,-20.9924749,14.3404397
35.8278288,-21.1678600,14.3568295
35.9246796,-21.3428138,14.3730693
36.0222813,-21.5173415,14.3891608
36.1206044,-21.6914677,14.4051054
36.2196158,-21.8652090,14.4209048
36.3192747,-22.0385692,14.4365604
36.4195539,-22.2115761,14.4520736
36.5204204,-22.3842483,14.4674460
36.6218312,-22.5565887,14.4826790
36.7237587,-22.7286294,14.4977740
36.8261668,-22.9003928,14.5127324
36.9290064,-23.0718814,14.5275557
37.0322531,-23.2431325,14.5422451
37.1358777,-23.4141583,14.5568021
37.2398586,-23.5849605,14.5712279
37.3441901,-23.7555537,14.5855240
37.4488618,-23.9259405,14.5996916
37.5538607,-24.0961217,14.6137319
37.6591788,-24.2661076,14.6276464
37.7648048,-24.4359026,14.6414362
37.8707285,-24.6055111,14.6551026
37.9769412,-24.7749400,14.6686468
38.0834324,-24.9441924,14.6820700
38.1901942,-25.1132758,14.6953735
38.2972174,-25.2821944,14.7085583
38.4044915,-25.4509504,14.7216258
38.5120114,-25.6195537,14.7345770
38.6197672,-25.7880066,14.7474131
38.7277486,-25.9563097,14.7601352
38.8359528,-26.1244753,14.7727445
38.9443703,-26.2925039,14.7852420
39.0529908,-26.4603943,14.7976289
39.1618142,-26.6281605,14.8099062
39.2708308,-26.7958016,14.8220749
39.3800303,-26.9633156,14.8341362
39.4894137,-27.1307174,14.8460911
39.5989716,-27.2980058,14.8579406
39.7086935,-27.4651778,14.8696858
39.8185812,-27.6322492,14.8813276
39.9286255,-27.7992182,14.8928670
40.0388159,-27.9660819,14.9043051
40.1491547,-28.1328557,14.9156427
40.2596328,-28.2995381,14.9268809
40.3702401,-28.4661260,14.9380207
40.4809789,-28.6326344,14.9490628
40.5918405,-28.7990618,14.9600084
40.7028153,-28.9654057,14.9708583
40.8139051,-29.1316799,14.9816134
40.9251017,-29.2978834,14.9922746
41.0363963,-29.4640141,15.0000000
41.1477899,-29.6300847,15.0000000
41.2592750,-29.7960945,15.0000000
41.3708436,-29.9620420,15.0000000
41.4824967,-30.1279384,15.0000000
41.5942262,-30.2937831,15.0000000
41.7060237,-30.4595784,15.0000000
41.8178824,-30.6253354,15.0000000
41.9297895,-30.7910595,15.0000000
42.0417315,-30.9567574,15.0000000
42.1536985,-31.1224406,15.0000000
42.2656778,-31.2881157,15.0000000
42.3776566,-31.4537891,15.0000000
42.4896250,-31.6194713,15.0000000
42.6015704,-31.7851691,15.0000000
42.7134803,-31.9508892,15.0000000
42.8253446,-32.1166417,15.0000000
42.9371509,-32.2824332,15.0000000
43.0488869,-32.4482710,15.0000000
43.1605421,-32.6141642,15.0000000
43.2721044,-32.7801199,15.0000000
43.3835617,-32.9461453,15.0000000
43.4949031,-33.1122491,15.0000000
43.6061166,-33.2784386,15.0000000
43.7171902,-33.4447212,15.0000000
43.8281127,-33.6111051,15.0000000
43.9388719,-33.7775975,15.0000000
44.0494563,-33.9442061,15.0000000
44.1598539,-34.1109385,15.0000000
44.2700527,-34.2778023,15.0000000
44.3800411,-34.4448051,15.0000000
44.4898067,-34.6119542,15.0000000
44.5993376,-34.7792570,15.0000000
44.7086219,-34.9467216,15.0000000
44.8176469,-35.1143545,15.0000000
44.9264006,-35.2821635,15.0000000
45.0348711,-35.4501566,15.0000000
45.1430451,-35.6183399,15.0000000
45.2509104,-35.7867211,15.0000000
45.3584551,-35.9553085,15.0000000
45.4656654,-36.1241076,15.0000000
45.5725291,-36.2931263,15.0000000
45.6790337,-36.4623727,15.0000000
45.7851654,-36.6318521,15.0000000
45.8909114,-36.8015722,15.0000000
45.9962595,-36.9715411,15.0000000
46.1011951,-37.1417635,15.0000000
46.2057049,-37.3122475,15.0000000
46.3097761,-37.4830013,15.0000000
46.4133949,-37.6540285,15.0000000
46.5165518,-37.8253344,15.0000000
46.6192389,-37.9969243,15.0000000
46.7214402,-38.1688022,15.0000000
46.8231401,-38.3409769,15.0000000
46.9243258,-38.5134565,15.0000000
47.0249961,-38.6862354,15.0000000
47.1251583,-38.8593093,15.0000000
47.2248187,-39.0326745,15.0000000
47.3239796,-39.2063241,15.0000000
47.4226454,-39.3802554,15.0000000
47.5208207,-39.5544659,15.0000000
47.6185080,-39.7289488,15.0000000
47.7157121,-39.9037013,15.0000000
47.8124375,-40.0787208,15.0000000
47.9086870,-40.2540010,15.0000000
48.0044654,-40.4295389,15.0000000
48.0997773,-40.6053321,15.0000000
48.1946257,-40.7813745,15.0000000
48.2890154,-40.9576631,15.0000000
48.3829511,-41.1341954,15.0000000
48.4764359,-41.3109657,15.0000000
48.5694747,-41.4879711,15.0000000
48.6620721,-41.6652089,15.0000000
48.7542317,-41.8426738,15.0000000
48.8459580,-42.0203629,15.0000000
48.9372559,-42.1982735,15.0000000
49.0281289,-42.3764007,15.0000000
49.1185819,-42.5547414,15.0000000
49.2086194,-42.7332930,15.0000000
49.2982455,-42.9120509,15.0000000
49.3874646,-43.0910122,15.0000000
49.4762816,-43.2701740,15.0000000
49.5647005,-43.4495321,15.0000000
49.6527259,-43.6290836,15.0000000
49.7403625,-43.8088256,15.0000000
49.8276146,-43.9887542,15.0000000
49.9144868,-44.1688667,15.0000000
50.0009836,-44.3491597,15.0000000
50.0871095,-44.5296302,15.0000000
50.1728692,-44.7102751,15.0000000
50.2582671,-44.8910911,15.0000000
50.3433081,-45.0720754,15.0000000
50.4279965,-45.2532251,15.0000000
50.5123359,-45.4345370,15.0000000
50.5963299,-45.6160097,15.0000000
50.6799812,-45.7976407,15.0000000
50.7632920,-45.9794275,15.0000000
50.8462657,-46.1613690,15.0000000
50.9289047,-46.3434630,15.0000000
51.0112115,-46.5257064,15.0000000
51.0931895,-46.7080987,15.0000000
51.1748412,-46.8906376,15.0000000
51.2561689,-47.0733201,15.0000000
51.3371760,-47.2561457,15.0000000
51.4178652,-47.4391121,15.0000000
51.4982387,-47.6222163,15.0000000
51.5783000,-47.8054581,15.0000000
51.6580516,-47.9888352,15.0000000
51.7374958,-48.1723445,15.0000000
51.8166361,-48.3559860,15.0000000
51.8954751,-48.5397573,15.0000000
51.9740149,-48.7236554,15.0000000
52.0522591,-48.9076805,15.0000000
52.1302102,-49.0918302,15.0000000
52.2078705,-49.2761015,15.0000000
52.2852435,-49.4604946,15.0000000
52.3623316,-49.6450072,15.0000000
52.4391371,-49.8296365,15.0000000
52.5156635,-50.0143825,15.0000000
52.5919132,-50.1992431,15.0000000
52.6678887,-50.3842156,15.0000000
52.7435932,-50.5692999,15.0000000
52.8190292,-50.7544940,15.0000000
52.8941991,-50.9397953,15.0000000
52.9691062,-51.1252038,15.0000000
53.0437530,-51.3107174,15.0000000
53.1181419,-51.4963337,15.0000000
53.1922761,-51.6820526,15.0000000
53.2661580,-51.8678721,15.0000000
53.3397902,-52.0537899,15.0000000
53.4131758,-52.2398059,15.0000000
53.4863172,-52.4259180,15.0000000
53.5592170,-52.6121244,15.0000000
53.6318782,-52.7984244,15.0000000
53.7043034,-52.9848164,15.0000000
53.7764950,-53.1712985,15.0000000
53.8484560,-53.3578701,15.0000000
53.9201884,-53.5445298,15.0000000
53.9916940,-53.7312761,15.0000000
54.0629750,-53.9181086,15.0000000
54.1340329,-54.1050260,15.0000000
54.2048695,-54.2920272,15.0000000
54.2754868,-54.4791114,15.0000000
54.3458865,-54.6662777,15.0000000
54.4160704,-54.8535249,15.0000000
54.4860404,-55.0408522,15.0000000
54.5557983,-55.2282585,15.0000000
54.6253457,-55.4157431,15.0000000
54.6946846,-55.6033049,15.0000000
54.7638179,-55.7909425,15.0000000
54.8327498,-55.9786543,15.0000000
54.9014861,-56.1664377,15.0000000
54.9700334,-56.3542902,15.0000000
55.0383984,-56.5422092,15.0000000
55.1065880,-56.7301919,15.0000000
55.1746087,-56.9182357,15.0000000
55.2424673,-57.1063382,15.0000000
55.3101704,-57.2944966,15.0000000
55.3777248,-57.4827084,15.0000000
55.4451373,-57.6709712,15.0000000
55.5124144,-57.8592824,15.0000000
55.5795631,-58.0476394,15.0000000
55.6465899,-58.2360398,15.0000000
55.7135018,-58.4244811,15.0000000
55.7803053,-58.6129607,15.0000000
55.8470074,-58.8014764,15.0000000
55.9136147,-58.9900255,15.0000000
55.9801341,-59.1786056,15.0000000
56.0465723,-59.3672145,15.0000000
56.1129360,-59.5558494,15.0000000
56.1792322,-59.7445081,15.0000000
56.2454677,-59.9331883,15.0000000
56.3116491,-60.1218873,15.0000000
56.3777834,-60.3106028,15.0000000
56.4438773,-60.4993326,15.0000000
56.5099377,-60.6880740,15.0000000
56.5759714,-60.8768248,15.0000000
56.6419852,-61.0655825,15.0000000
56.7079863,-61.2543447,15.0000000
56.7739796,-61.4431096,15.0000000
56.8399667,-61.6318767,15.0000000
56.9059445,-61.8206470,15.0000000
56.9719087,-62.0094221,15.0000000
57.0378562,-62.1982030,15.0000000
57.1037866,-62.3869899,15.0000000
57.1697006,-62.5757825,15.0000000
57.2355995,-62.7645804,15.0000000
57.3014841,-62.9533833,15.0000000
57.3673554,-63.1421908,15.0000000
57.4332142,-63.3310027,15.0000000
57.4990617,-63.5198185,15.0000000
57.5648985,-63.7086380,15.0000000
57.6307258,-63.8974609,15.0000000
57.6965444,-64.0862868,15.0000000
57.7623553,-64.2751154,15.0000000
57.8281594,-64.4639463,15.0000000
57.8939576,-64.6527793,15.0000000
57.9597510,-64.8416141,15.0000000
58.0255403,-65.0304502,15.0000000
58.0913265,-65.2192873,15.0000000
58.1571106,-65.4081252,15.0000000
58.2228935,-65.5969636,15.0000000
58.2886762,-65.7858020,15.0000000
58.3544595,-65.9746402,15.0000000
58.4202445,-66.1634778,15.0000000
58.4860320,-66.3523146,15.0000000
58.5518229,-66.5411501,15.0000000
58.6176183,-66.7299841,15.0000000
58.6834190,-66.9188162,15.0000000
58.7492260,-67.1076462,15.0000000
58.8150402,-67.2964736,15.0000000
58.8808625,-67.4852982,15.0000000
58.9466931,-67.6741199,15.0000000
59.0125319,-67.8629388,15.0000000
59.0783777,-68.0517552,15.0000000
59.1442299,-68.2405694,15.0000000
59.2100883,-68.4293814,15.0000000
59.2759529,-68.6181912,15.0000000
59.3418239,-68.8069989,15.0000000
59.4077012,-68.9958043,15.0000000
59.4735850,-69.1846074,15.0000000
59.5394753,-69.3734083,15.0000000
59.6053722,-69.5622069,15.0000000
59.6712757,-69.7510032,15.0000000
59.7371859,-69.9397971,15.0000000
59.8031029,-70.1285887,15.0000000
59.8690267,-70.3173779,15.0000000
59.9349574,-70.5061647,15.0000000
60.0008951,-70.6949491,15.0000000
60.0668398,-70.8837310,15.0000000
60.1327915,-71.0725104,15.0000000
60.1987504,-71.2612873,15.0000000
60.2647165,-71.4500618,15.0000000
60.3306899,-71.6388336,15.0000000
60.3966706,-71.8276030,15.0000000
60.4626587,-72.0163697,15.0000000
60.5286542,-72.2051338,15.0000000
60.5946573,-72.3938953,15.0000000
60.6606680,-72.5826541,15.0000000
60.7266863,-72.7714103,15.0000000
60.7927124,-72.9601638,15.0000000
60.8587462,-73.1489145,15.0000000
60.9247878,-73.3376625,15.0000000
60.9908374,-73.5264077,15.0000000
61.0568949,-73.7151502,15.0000000
61.1229605,-73.9038898,15.0000000
61.1890342,-74.0926266,15.0000000
61.2551160,-74.2813606,15.0000000
61.3212060,-74.4700916,15.0000000
61.3873043,-74.6588198,15.0000000
61.4534110,-74.8475450,15.0000000
61.5195261,-75.0362673,15.0000000
61.5856496,-75.2249866,15.0000000
61.6517817,-75.4137030,15.0000000
61.7179224,-75.6024163,15.0000000
61.7840718,-75.7911266,15.0000000
61.8502299,-75.9798338,15.0000000
61.9163968,-76.1685379,15.0000000
61.9825725,-76.3572390,15.0000000
62.0487572,-76.5459369,15.0000000
62.1149508,-76.7346316,15.0000000
62.1811535,-76.9233232,15.0000000
62.2473653,-77.1120116,15.0000000
62.3135863,-77.3006967,15.0000000
62.3798165,-77.4893787,15.0000000
62.4460560,-77.6780573,15.0000000
62.5123049,-77.8667327,15.0000000
62.5785632,-78.0554047,15.0000000
62.6448310,-78.2440735,15.0000000
62.7111083,-78.4327388,15.0000000
62.7773953,-78.6214008,15.0000000
62.8436919,-78.8100594,15.0000000
62.9099983,-78.9987146,15.0000000
62.9763145,-79.1873663,15.0000000
63.0426406,-79.3760145,15.0000000
63.1089766,-79.5646593,15.0000000
63.1753226,-79.7533005,15.0000000
63.2416786,-79.9419382,15.0000000
63.3080448,-80.1305724,15.0000000
63.3744212,-80.3192029,15.0000000
63.4408078,-80.5078298,15.0000000
63.5072048,-80.6964532,15.0000000
63.5736121,-80.8850728,15.0000000
63.6400299,-81.0736888,15.0000000
63.7064582,-81.2623011,15.0000000
63.7728970,-81.4509096,15.0000000
63.8393465,-81.6395144,15.0000000
63.9058067,-81.8281155,15.0000000
63.9722776,-82.0167127,15.0000000
64.0387594,-82.2053062,15.0000000
64.1052520,-82.3938958,15.0000000
64.1717556,-82.5824815,15.0000000
64.2382703,-82.7710633,15.0000000
64.3047960,-82.9596413,15.0000000
64.3713328,-83.1482153,15.0000000
64.4378808,-83.3367853,15.0000000
64.5044402,-83.5253514,15.0000000
64.5710108,-83.7139135,15.0000000
64.6375929,-83.9024715,15.0000000
64.7041864,-84.0910255,15.0000000
64.7707914,-84.2795755,15.0000000
64.8374080,-84.4681213,15.0000000
64.9040363,-84.6566630,15.0000000
64.9706762,-84.8452006,15.0000000
65.0373280,-85.0337340,15.0000000
65.1039916,-85.2222633,15.0000000
65.1706671,-85.4107883,15.0000000
65.2373546,-85.5993091,15.0000000
65.3040541,-85.7878256,15.0000000
65.3707656,-85.9763379,15.0000000
65.4374894,-86.1648458,15.0000000
65.5042260,-86.3533493,15.0000000
65.5709761,-86.5418479,15.0000000
65.6377405,-86.7303414,15.0000000
65.7045201,-86.9188296,15.0000000
65.7713156,-87.1073122,15.0000000
65.8381279,-87.2957888,15.0000000
65.9049577,-87.4842591,15.0000000
65.9718057,-87.6727231,15.0000000
66.0386714,-87.8611807,15.0000000
66.1055538,-88.0496324,15.0000000
66.1724516,-88.2380787,15.0000000
66.2393640,-88.4265198,15.0000000
66.3062905,-88.6149559,15.0000000
66.3732304,-88.8033872,15.0000000
66.4401831,-88.9918140,15.0000000
66.5071477,-89.1802365,15.0000000
66.5741239,-89.3686549,15.0000000
66.6411107,-89.5570695,15.0000000
66.7081077,-89.7454805,15.0000000
66.7751142,-89.9338882,15.0000000
66.8421294,-90.1222927,15.0000000
66.9091529,-90.3106943,15.0000000
66.9761838,-90.4990933,15.0000000
67.0432216,-90.6874898,15.0000000
67.1102657,-90.8758840,15.0000000
67.1773154,-91.0642763,15.0000000
67.2443698,-91.2526668,15.0000000
67.3114284,-91.4410560,15.0000000
67.3784911,-91.6294436,15.0000000
67.4455580,-91.8178297,15.0000000
67.5126258,-92.0062155,14.9461515
67.5796897,-92.1946027,14.7262178
67.6467591,-92.3829879,14.5060295
67.7138513,-92.5713651,14.2858031
67.7809702,-92.7597326,14.0649815
67.8480286,-92.9481221,13.8529875
67.9148782,-93.1365853,13.6526643
67.9813418,-93.3251850,13.4582555
68.0472945,-93.5139639,13.2682728
68.1126401,-93.7029541,13.0814726
68.1772943,-93.8921821,12.8981386
68.2411681,-94.0816750,12.7192180
68.3041533,-94.2714640,12.5460530
68.3661200,-94.4615901,12.3790724
68.4269280,-94.6520889,12.2172268
68.4864489,-94.8429914,12.0590529
68.5445762,-95.0343284,11.9036224
68.6012078,-95.2261099,11.7509323
68.6562424,-95.4183515,11.6011430
68.7095766,-95.6110815,11.4542595
68.7610963,-95.8042979,11.3102015
68.8106896,-95.9980127,11.1688968
68.8582456,-96.1922502,11.0304320
68.9036406,-96.3869955,10.8947598
68.9467537,-96.5822536,10.7618421
68.9874638,-96.7780402,10.6316539
69.0256394,-96.9743275,10.5041274
69.0611522,-97.1711095,10.3792070
69.0938735,-97.3683873,10.2568772
69.1236659,-97.5661200,10.1370699
69.1503949,-97.7642867,10.0197263
69.1739249,-97.9628683,9.9046986
69.1941170,-98.1618101,9.7919079
69.2108340,-98.3610723,9.6812889
69.2239367,-98.5606098,9.5731598
69.2332787,-98.7603547,9.4676636
69.2387087,-98.9602455,9.3649844
69.2400708,-99.1602041,9.2650525
69.2372097,-99.3601470,9.1677344
69.2299729,-99.5599824,9.0728928
69.2182123,-99.7595959,8.9803578
69.2017827,-99.9588822,8.8900914
69.1805413,-100.1577193,8.8020753
69.1543514,-100.3559517,8.7162400
69.1230754,-100.5534517,8.6326241
69.0865794,-100.7500647,8.5512930
69.0447420,-100.9455873,8.4719653
68.9974369,-101.1398696,8.3958102
68.9445232,-101.3327193,8.3241780
68.8858143,-101.5238515,8.2699734
68.8209186,-101.7129971,8.2289950
68.7495524,-101.8997924,8.1961934
68.6717014,-102.0839774,8.1632600
68.5879503,-102.2655600,8.1614125
68.4989443,-102.4446113,8.1848029
68.4051988,-102.6212478,8.2271971
68.3072477,-102.7955782,8.2882016
68.2056615,-102.9678075,8.3698984
68.1010392,-103.1382274,8.4624472
67.9939565,-103.3070995,8.5532643
67.8849362,-103.4747338,8.6424103
67.7744968,-103.6414298,8.7299420
67.6631417,-103.8075164,8.8159130
67.5513500,-103.9733324,8.9003741
67.4396198,-104.1391492,8.9833733
67.3283700,-104.3053098,9.0649561
67.2180265,-104.4721066,9.1451655
67.1090495,-104.6397393,9.2240425
67.0018017,-104.8085185,9.3016261
66.8966936,-104.9786585,9.2563712
66.7941580,-105.1503188,9.1142601
66.6945762,-105.3237355,8.9870943
66.5983923,-105.4990547,8.8755000
66.5060668,-105.6764371,8.7832885
66.4181272,-105.8560336,8.7126851
66.3351678,-106.0379590,8.6664007
66.2577532,-106.2223562,8.6315195
66.1863092,-106.4091280,8.5971134
66.1209675,-106.5980732,8.5625691
66.0616044,-106.7890435,8.5400676
66.0083341,-106.9817527,8.5162215
65.9613208,-107.1761016,8.4827471
65.9207483,-107.3719038,8.4486623
65.8865166,-107.5689147,8.4260378
65.8584245,-107.7668874,8.4151197
65.8362488,-107.9656217,8.4157748
65.8197952,-108.1649064,8.4252128
65.8088559,-108.3645618,8.4433183
65.8032006,-108.5644544,8.4701918
65.8025886,-108.7644171,8.5058112
65.8067687,-108.9643270,8.5498327
65.8154826,-109.1641125,8.6020161
65.8284581,-109.3636553,8.6626508
65.8454158,-109.5628892,8.7315949
65.8660748,-109.7617945,8.8087944
65.8901480,-109.9603036,8.8933797
65.9173554,-110.1584029,8.9764992
65.9474240,-110.3560996,9.0581985
65.9800807,-110.5533785,9.1385209
66.0150594,-110.7502624,9.2175077
66.0520940,-110.9467659,9.2951978
66.0909253,-111.1429225,9.3716286
66.1313016,-111.3387801,9.4468355
66.1729686,-111.5343455,9.5208522
66.2156927,-111.7296914,9.5937112
66.2592446,-111.9248764,9.6654432
66.3033869,-112.1198918,9.7360777
66.3479140,-112.3148361,9.8056431
66.3926171,-112.5097663,9.8741663
66.4372757,-112.7046621,9.9416734
66.4817037,-112.8996314,10.0081891
66.5257049,-113.0947216,10.0737375
66.5690707,-113.2899115,10.1383415
66.6116219,-113.4853009,10.2020231
66.6531660,-113.6809250,10.2648037
66.6935008,-113.8767687,10.3267037
66.7324419,-114.0729109,10.3877429
66.7697870,-114.2693727,10.4479401
66.8053233,-114.4661496,10.4904393
66.8388404,-114.6632904,10.3354006
66.8701160,-114.8608022,10.1871557
66.8989241,-115.0586805,10.0455364
66.9250405,-115.2569366,9.9103986
66.9482369,-115.4555535,9.7816359
66.9682845,-115.6545142,9.6591932
66.9849523,-115.8537862,9.5430475
66.9980073,-116.0533207,9.4332214
67.0072161,-116.2530804,9.3297510
67.0123426,-116.4529812,9.2327547
67.0131504,-116.6529353,9.1424125
67.0094006,-116.8528751,9.0590401
67.0008527,-117.0526573,8.9830228
66.9872646,-117.2521453,8.9148419
66.9683849,-117.4512301,8.8555734
66.9439610,-117.6496965,8.8060074
66.9137338,-117.8473419,8.7670966
66.8774559,-118.0440070,8.7321501
66.8350191,-118.2394115,8.6970632
66.7865165,-118.4333777,8.6664740
66.7321910,-118.6258365,8.6488709
66.6722336,-118.8165913,8.6371101
66.6068112,-119.0055337,8.6315399
66.5361061,-119.1925899,8.6326373
66.4603368,-119.3776385,8.6408344
66.3796999,-119.5606115,8.6552227
66.2943749,-119.7414643,8.6749479
66.2045632,-119.9201224,8.7000687
66.1104539,-120.0965490,8.7302512
66.0122263,-120.2707297,8.7652116
65.9100736,-120.4426312,8.8047842
65.8041771,-120.6122486,8.8487950
65.6947119,-120.7795936,8.8971089
65.5818614,-120.9446703,8.9496747
65.4657985,-121.1075040,9.0063737
65.3466935,-121.2681283,9.0671198
65.2247170,-121.4265812,9.1319391
65.1000313,-121.5829157,9.2007760
64.9728028,-121.7371807,9.2735909
64.8431796,-121.8894406,9.3500181
64.7112964,-122.0397606,9.4255695
64.5772987,-122.1881778,9.4999214
64.4412890,-122.3347628,9.5731064
64.3033734,-122.4795744,9.6451558
64.1636817,-122.6226437,9.7160996
64.0222935,-122.7640500,9.7859662
63.8793019,-122.9038534,9.8547831
63.7348220,-123.0420874,9.9225766
63.5889161,-123.1788300,9.9893718
63.4416646,-123.3141367,10.0551929
63.2931628,-123.4480458,10.1200632
63.1434659,-123.5806295,10.1840050
62.9926418,-123.7119365,10.2470397
62.8407598,-123.8420056,10.3091881
62.6878687,-123.9708932,10.3704701
62.5340450,-124.0986665,10.4309049
62.3793813,-124.2254188,10.4905110
62.2239787,-124.3512653,10.5493064
62.0679392,-124.4763214,10.6073082
61.9113634,-124.6007049,10.6645331
61.7543570,-124.7245448,10.7209973
61.5970078,-124.8479485,10.7767164
61.4393820,-124.9709990,10.8317055
61.2815328,-125.0937626,10.8859791
61.1235091,-125.2163016,10.9395513
60.9653591,-125.3386775,10.9924360
60.8071297,-125.4609509,11.0446463
60.6488692,-125.5831841,11.0961952
60.4906264,-125.7054399,11.1470952
60.3324464,-125.8277772,11.1973583
60.1743609,-125.9502366,11.2469964
60.0163871,-126.0728399,11.2960208
59.8585304,-126.1955939,11.3444428
59.7007933,-126.3185017,11.3922731
59.5431776,-126.4415651,11.4395222
59.3856838,-126.5647844,11.4862003
59.2283104,-126.6881575,11.5323174
59.0710534,-126.8116789,11.5778831
58.9139062,-126.9353400,11.6229069
58.7568629,-127.0591330,11.6673980
58.5999189,-127.1830519,11.7113652
58.4430696,-127.3070906,11.7548174
58.2863101,-127.4312428,11.7977629
58.1296354,-127.5555019,11.8402101
57.9730404,-127.6798615,11.8821671
57.8165202,-127.8043153,11.9236416
57.6600699,-127.9288569,11.9646416
57.5036845,-128.0534800,12.0051743
57.3473589,-128.1781781,12.0452472
57.1910882,-128.3029450,12.0848675
57.0348673,-128.4277743,12.1240420
56.8786913,-128.5526596,12.1627777
56.7225551,-128.6775948,12.2010813
56.5664537,-128.8025734,12.2389592
56.4103820,-128.9275891,12.2764179
56.2543350,-129.0526357,12.3134635
56.0983076,-129.1777067,12.3501023
55.9422949,-129.3027960,12.3863401
55.7862917,-129.4278973,12.4221829
55.6302931,-129.5530042,12.4576363
55.4742939,-129.6781105,12.4927059
55.3182891,-129.8032096,12.5273973
55.1622735,-129.9282953,12.5617158
55.0062426,-130.0533619,12.5956667
54.8501921,-130.1784042,12.6292551
54.6941158,-130.3034142,12.6624861
54.5380027,-130.4283782,12.6953647
54.3818377,-130.5532774,12.7278957
54.2256059,-130.6780930,12.7600838
54.0692973,-130.8028123,12.7919337
53.9129064,-130.9274285,12.8234500
53.7564289,-131.0519360,12.8546373
53.5998605,-131.1763290,12.8854998
53.4431963,-131.3006015,12.9160420
53.2864317,-131.4247473,12.9462680
53.1295613,-131.5487593,12.9761820
52.9725801,-131.6726310,13.0057881
52.8154866,-131.7963602,13.0350904
52.6582828,-131.9199493,12.8690019
52.5009696,-132.0433987,12.6429075
52.3435323,-132.1666898,12.4217934
52.1858955,-132.2897268,12.2102974
52.0279334,-132.4123444,12.0096615
51.8695073,-132.5343621,11.8175687
51.7104965,-132.6556182,11.6319543
51.5508088,-132.7759789,11.4487955
51.3903784,-132.8953488,11.2681426
51.2291451,-133.0136338,11.0900486
51.0670490,-133.1307295,10.9154028
50.9040185,-133.2465209,10.7442235
50.7399797,-133.3608850,10.5765057
50.5748681,-133.4736844,10.4126416
50.4086046,-133.5847806,10.2527148
50.2411096,-133.6940257,10.0967666
50.0723273,-133.8012476,9.9450630
49.9021725,-133.9062849,9.7976460
49.7305688,-134.0089620,9.6545307
49.5574786,-134.1090738,9.5158667
49.3828188,-134.2064363,9.3815872
49.2065300,-134.3008471,9.2516253
49.0286003,-134.3920766,9.1258641
48.8489655,-134.4799230,9.0040915
48.6675985,-134.5641660,8.8861275
48.4845208,-134.6445669,8.7716135
48.2997053,-134.7209145,8.6600906
48.1131703,-134.7929866,8.5511490
47.9249775,-134.8605569,8.4438497
47.7351526,-134.9234278,8.3381925
47.5437676,-134.9813865,8.2342354
47.3509094,-135.0342104,8.1328474
47.1566557,-135.0816645,8.0340020
46.9611235,-135.1235014,7.9377000
46.7644179,-135.1594833,7.8426193
46.5667000,-135.1893847,7.7480804
46.3681546,-135.2130010,7.6534604
46.1689080,-135.2301461,7.5593554
45.9692165,-135.2406099,7.4666432
45.7693204,-135.2441658,7.3762691
45.5693562,-135.2405850,7.2848300
45.3696884,-135.2297181,7.1916102
45.1706053,-135.2115269,7.0933603
44.9722423,-135.1860226,6.9860905
44.7750236,-135.1531753,6.8742023
44.5792097,-135.1127785,6.7666609
44.3851846,-135.0644848,6.6678181
44.1934206,-135.0078869,6.5779729
44.0044189,-134.9425744,6.4978518
43.8188347,-134.8682137,6.4257647
43.6372522,-134.7845090,6.3622023
43.4603686,-134.6912478,6.3081261
43.2889899,-134.5882828,6.2693676
43.1239471,-134.4754116,6.2403208
42.9660922,-134.3527032,6.2154462
42.8161126,-134.2204800,6.1904718
42.6745289,-134.0793107,6.1735557
42.5418416,-133.9297542,6.1600664
42.4185861,-133.7723299,6.1462983
42.3052916,-133.6075934,6.1192575
42.2025030,-133.4360998,6.0871325
42.1108112,-133.2584330,6.0601317
42.0308295,-133.0751957,6.0352635
41.9630599,-132.8870961,6.0103759
41.9078831,-132.6949216,5.9864179
41.8656756,-132.4994808,5.9623637
41.8364716,-132.3017119,5.9466273
41.8198520,-132.1024220,5.9469359
41.8150586,-131.9025290,5.9746624
41.8213418,-131.7027357,6.0212211
41.8380793,-131.5034516,6.0804032
41.8646752,-131.3052891,6.1486377
41.9005572,-131.1086153,6.2245230
41.9451843,-130.9136977,6.3070612
41.9980278,-130.7208714,6.3942363
42.0586239,-130.5303153,6.4849044
42.1265183,-130.3422616,6.5781987
42.2013130,-130.1568397,6.6729397
42.2826484,-129.9741347,6.7687773
42.3701163,-129.7943625,6.8654482
42.4634199,-129.6175232,6.9624726
42.5622664,-129.4436461,7.0597528
42.6662783,-129.2729137,7.1572314
42.7752308,-129.1052535,7.2548573
42.8888712,-128.9406580,7.3527299
43.0068494,-128.7792550,7.4509443
43.1289847,-128.6209303,7.5496900
43.2550467,-128.4656489,7.6490976
43.3847207,-128.3134727,7.7492927
43.5178516,-128.1642669,7.8505594
43.6542217,-128.0179690,7.9532098
43.7935538,-127.8745693,8.0539375
43.9357001,-127.7339169,8.1526278
44.0804526,-127.5959280,8.2493602
44.2275933,-127.4605296,8.3442089
44.3769790,-127.3275845,8.4372436
44.5284213,-127.1970039,8.5285294
44.6817855,-127.0686596,8.6181279
44.8369100,-126.9424554,8.7060967
44.9936350,-126.8182995,8.7924906
45.1519109,-126.6960217,8.8773608
45.3115406,-126.5755736,8.9607563
45.4724004,-126.4568522,9.0427231
45.6345002,-126.3396609,9.1233049
45.7976065,-126.2239802,9.2025433
45.9616285,-126.1096824,9.2804779
46.1265927,-125.9965555,9.3571460
46.2922455,-125.8845696,9.4325837
46.4585119,-125.7735563,9.5068249
46.6253881,-125.6632863,9.5799023
46.7926283,-125.5536832,9.6518469
46.9601491,-125.4445607,9.7226885
47.1279224,-125.3356945,9.7924557
47.2957268,-125.2269695,9.8611757
47.4634771,-125.1181582,9.9288746
47.6310454,-125.0090344,9.9955776
47.7982526,-124.8993796,10.0613087
47.9649616,-124.7889293,10.1260910
48.1309517,-124.6774575,10.1899470
48.2960753,-124.5646767,10.0860082
48.4601462,-124.4503170,9.9161716
48.6228886,-124.3341682,9.7572411
48.7841541,-124.2159309,9.6087978
48.9437179,-124.0953623,9.4705055
49.1012853,-123.9722810,9.3417133
49.2566784,-123.8464267,9.2219864
49.4096496,-123.7176036,9.1109724
49.5598947,-123.5856804,9.0078105
49.7072081,-123.4504613,8.9118043
49.8513336,-123.3118186,8.8223569
49.9919716,-123.1696981,8.7385131
50.1289105,-123.0239832,8.6607785
50.2618800,-122.8746114,8.5897458
50.3905570,-122.7215720,8.5260794
50.5146719,-122.5647873,8.4691001
50.6339174,-122.4042597,8.4182703
50.7479934,-122.2400358,8.3721518
50.8566408,-122.0721583,8.3313396
50.9595674,-121.9007297,8.2964482
51.0565167,-121.7258274,8.2633777
51.1472606,-121.5476346,8.2301744
51.2316726,-121.3663957,8.1993145
51.3097528,-121.1822853,8.1741866
51.3814238,-120.9956179,8.1527937
51.4466929,-120.8066324,8.1367128
51.5056505,-120.6155447,8.1273089
51.5584596,-120.4226855,8.1299975
51.6053058,-120.2283057,8.1423669
51.6463588,-120.0325945,8.1624194
51.6817683,-119.8357967,8.1890574
51.7116890,-119.6380922,8.2213576
51.7362673,-119.4396448,8.2585236
51.7556371,-119.2406253,8.2994644
51.7699349,-119.0411731,8.3439163
51.7792984,-118.8414321,8.3916489
51.7838690,-118.6415225,8.4425292
51.7837896,-118.4415542,8.4963972
51.7792049,-118.2416475,8.5531164
51.7702605,-118.0418846,8.6125836
51.7571019,-117.8423473,8.6746741
51.7398761,-117.6431313,8.7392861
51.7187277,-117.4442888,8.8063495
51.6938011,-117.2458764,8.8757964
51.6652438,-117.0479661,8.9475756
51.6331974,-116.8505858,9.0216607
51.5978043,-116.6537704,9.0980272
51.5592104,-116.4575691,9.1766644
51.5175543,-116.2619905,9.2550229
51.4729757,-116.0670501,9.3321030
51.4256179,-115.8727768,9.4079410
51.3756157,-115.6791631,9.4825714
51.3231066,-115.4862080,9.5560276
51.2682315,-115.2939216,9.6283409
51.2111193,-115.1022840,9.6995416
51.1518911,-114.9112848,9.7696586
51.0906600,-114.7209254,9.8387196
51.0275211,-114.5311868,9.9067510
50.9625747,-114.3420573,9.9737784
50.8959335,-114.1535217,10.0398261
50.8277328,-113.9655432,10.1049175
50.7581188,-113.7780830,10.1690753
50.6872367,-113.5910995,10.2323211
50.6152172,-113.4045507,10.2946758
50.5421933,-113.2183928,10.3561594
50.4683017,-113.0325776,10.4167915
50.3936771,-112.8470555,10.4765905
50.3184273,-112.6617862,10.5355746
50.2426329,-112.4767389,10.5937612
50.1663569,-112.2918896,10.6511671
50.0896667,-112.1072117,10.7078085
50.0126344,-111.9226763,10.7637011
49.9353291,-111.7382551,10.8188602
49.8578193,-111.5539197,10.8733005
49.7801735,-111.3696416,10.9270362
49.7024606,-111.1853918,10.9800811
49.6247489,-111.0011414,11.0324486
49.5471062,-110.8168620,11.0841516
49.4696002,-110.6325250,11.1352028
49.3922983,-110.4481022,11.1856144
49.3152681,-110.2635659,11.2353981
49.2385784,-110.0788878,11.2845657
49.1622980,-109.8940404,11.3331281
49.0864882,-109.7089992,11.3810963
49.0111884,-109.5237500,11.4284810
48.9364094,-109.3382903,11.4752922
48.8621467,-109.1526229,11.5215402
48.7884076,-108.9667471,11.5672345
48.7151978,-108.7806623,11.6123847
48.6425204,-108.5943687,11.6570000
48.5703798,-108.4078667,11.7010894
48.4987812,-108.2211560,11.7446617
48.4277295,-108.0342364,11.7877254
48.3572295,-107.8471080,11.8302889
48.2872858,-107.6597710,11.8723602
48.2179035,-107.4722254,11.9139474
48.1490874,-107.2844713,11.9550581
48.0808423,-107.0965088,11.9956998
48.0131731,-106.9083383,12.0358800
47.9460848,-106.7199599,12.0756059
47.8795822,-106.5313738,12.1148845
47.8136703,-106.3425806,12.1537226
47.7483541,-106.1535805,12.1921271
47.6836385,-105.9643737,12.2301043
47.6195284,-105.7749611,12.2676608
47.5560281,-105.5853432,12.3048029
47.4931397,-105.3955212,12.3415367
47.4308609,-105.2054986,12.3778681
47.3691793,-105.0152813,12.4138031
47.3080831,-104.8248749,12.4493474
47.2475625,-104.6342851,12.4845066
47.1876078,-104.4435164,12.5192863
47.1282100,-104.2525733,12.5536919
47.0693609,-104.0614608,12.5877286
47.0110513,-103.8701829,12.6214017
46.9532723,-103.6787437,12.6547162
46.8960152,-103.4871481,12.6876771
46.8392711,-103.2953999,12.7202892
46.7830311,-103.1035030,12.7525574
46.7272861,-102.9114620,12.7844863
46.6720259,-102.7192809,12.8160805
46.6172398,-102.5269638,12.8473446
46.5629172,-102.3345157,12.8782830
46.5090468,-102.1419403,12.9089000
46.4556178,-101.9492419,12.9391998
46.4026194,-101.7564248,12.9691868
46.3500404,-101.5634928,12.9988648
46.2978701,-101.3704499,13.0282381
46.2460973,-101.1773000,13.0573104
46.1947110,-100.9840469,13.0860858
46.1437002,-100.7906944,13.1145681
46.0930539,-100.5972461,13.1427609
46.0427609,-100.4037056,13.1706680
45.9928101,-100.2100766,13.1982930
45.9431905,-100.0163623,13.2256394
45.8938908,-99.8225664,13.2527107
45.8449000,-99.6286923,13.2795104
45.7962069,-99.4347430,13.3060419
45.7478002,-99.2407222,13.3323084
45.6996688,-99.0466329,13.3583132
45.6518014,-98.8524782,13.3840595
45.6041869,-98.6582614,13.4095505
45.5568140,-98.4639856,13.4347892
45.5096713,-98.2696537,13.4597788
45.4627477,-98.0752687,13.4845222
45.4160320,-97.8808340,13.5090224
45.3695126,-97.6863518,13.5332823
45.3231785,-97.4918255,13.5573047
45.2770183,-97.2972581,13.5810924
45.2310206,-97.1026519,13.6046483
45.1851741,-96.9080102,13.6279751
45.1394676,-96.7133357,13.6510754
45.0938896,-96.5186308,13.6739518
45.0484288,-96.3238985,13.6966071
45.0030740,-96.1291418,13.7190436
44.9578136,-95.9343628,13.7412641
44.9126364,-95.7395646,13.7632708
44.8675311,-95.5447500,13.7850664
44.8224862,-95.3499210,13.8066532
44.7774905,-95.1550808,13.8280335
44.7325324,-94.9602321,13.8492098
44.6876006,-94.7653771,13.8701843
44.6426839,-94.5705186,13.8909593
44.5977720,-94.3756593,13.9115370
44.5528550,-94.1808009,13.9319196
44.5079239,-93.9859458,13.9521094
44.4629698,-93.7910961,13.9721084
44.4179835,-93.5962537,13.9919188
44.3729558,-93.4014210,14.0115426
44.3278776,-93.2065999,14.0309819
44.2827397,-93.0117926,14.0502387
44.2375333,-92.8170013,14.0693151
44.1922489,-92.6222280,14.0882129
44.1468771,-92.4274752,14.1069342
44.1014091,-92.2327448,14.1254808
44.0558376,-92.0380383,14.1438546
44.0101549,-91.8433584,14.1620575
43.9643462,-91.6487078,14.1800914
43.9183783,-91.4540943,14.1979580
43.8721944,-91.2595326,14.2156591
43.8257071,-91.0650431,14.2331964
43.7788424,-90.8706438,14.2505718
43.7315425,-90.6763507,14.2677870
43.6837513,-90.4821777,14.2848436
43.6354109,-90.2881396,14.3017433
43.5864629,-90.0942553,14.3184877
43.5368485,-89.9005402,14.3350785
43.4865093,-89.7070109,14.3515174
43.4353896,-89.5136881,14.3678058
43.3834360,-89.3205873,14.3839453
43.3305983,-89.1277250,14.3999375
43.2768291,-88.9351226,14.4157839
43.2220778,-88.7427964,14.4314861
43.1662931,-88.5507657,14.4470455
43.1094241,-88.3590559,14.4624635
43.0514176,-88.1676867,14.4049624
42.9922202,-87.9766801,14.2732013
42.9317805,-87.7860664,14.1437419
42.8700439,-87.5958681,14.0165488
42.8069559,-87.4061106,13.8915856
42.7424650,-87.2168299,13.7688660
42.6765154,-87.0280515,13.6483445
42.6090520,-86.8398043,13.5299587
42.5400252,-86.6521313,13.4135187
42.4693810,-86.4650594,13.2991448
42.3970651,-86.2786214,13.1869958
42.3230253,-86.0928696,13.0779476
42.2471922,-85.9078401,12.9723001
42.1694933,-85.7235804,12.8702403
42.0898612,-85.5401569,12.7715431
42.0082219,-85.3576150,12.6760485
41.9245079,-85.1760090,12.5836338
41.8386619,-84.9954104,12.4941605
41.7506187,-84.8158693,12.4075109
41.6603201,-84.6374466,12.3235930
41.5677173,-84.4602172,12.2422383
41.4727549,-84.2842374,12.1633601
41.3753848,-84.1095747,12.0868934
41.2755667,-83.9363054,12.0126919
41.1732552,-83.7644937,11.9406959
41.0684131,-83.5942135,11.8708678
40.9610064,-83.4255413,11.8031239
40.8510011,-83.2585506,11.7374044
40.7383703,-83.0933222,11.6736784
40.6230848,-82.9299310,11.6119493
40.5051233,-82.7684619,11.5522948
40.3844674,-82.6090038,11.4947616
40.2610899,-82.4516303,11.4386254
40.1349906,-82.2964333,11.3833158
40.0061768,-82.1434939,11.3283606
39.8746443,-81.9928659,11.2737163
39.7404213,-81.8446390,11.2196966
39.6035245,-81.6988949,11.1665934
39.4639423,-81.5556927,11.1147748
39.3217049,-81.4151413,11.0643578
39.1768242,-81.2773312,11.0154640
39.0292925,-81.1423369,10.9683845
38.8791432,-81.0102746,10.9231065
38.7263906,-80.8812394,10.8795619
38.5710509,-80.7553184,10.8359449
38.4131787,-80.6325974,10.7926577
38.2528227,-80.5131286,10.7507405
38.0900621,-80.3969713,10.7109128
37.9249463,-80.2841796,10.6718657
37.7575348,-80.1748070,10.6340561
37.5879149,-80.0689181,10.5977942
37.4161314,-79.9665617,10.5621046
37.2422515,-79.8678001,10.5270930
37.0663569,-79.7726902,10.4928887
36.8885199,-79.6812534,10.4613992
36.7088369,-79.5935014,10.4331537
36.5274018,-79.5094306,10.4085657
36.3443078,-79.4290348,10.3874743
36.1596524,-79.3523083,10.3696751
35.9735114,-79.2792341,10.3549810
35.7859851,-79.2098016,10.3434283
35.5971666,-79.1439943,10.3348660
35.4071153,-79.0817821,10.3291539
35.2159372,-79.0231482,10.3262801
35.0237194,-78.9680657,10.3261467
34.8305059,-78.9164937,10.3286620
34.6364062,-78.8684069,10.3338371
34.4415008,-78.8237681,10.3416075
34.2458194,-78.7825267,10.3519140
34.0494724,-78.7446469,10.3648108
33.8525325,-78.7100812,10.3802299
33.6550176,-78.6787707,10.3981185
33.4570355,-78.6506661,10.4187240
33.2586489,-78.6257071,10.4419801
33.0598711,-78.6038308,10.4677853
32.8607956,-78.5849989,10.4949336
32.6614659,-78.5691827,10.5226297
32.4619049,-78.5563649,10.5502201
32.2621817,-78.5465344,10.5774858
32.0623378,-78.5396768,10.6045021
31.8624077,-78.5357771,10.6313186
31.6624453,-78.5348220,10.6578059
31.4624893,-78.5367994,10.6838924
31.2625842,-78.5416982,10.7095187
31.0627723,-78.5495085,10.7346033
30.8630904,-78.5602214,10.7590953
30.6635907,-78.5738282,10.7829526
30.4643077,-78.5903221,10.8061034
30.2652774,-78.6096975,10.8285025
30.0665567,-78.6319473,10.8501151
29.8681765,-78.6570677,10.8708933
29.6701724,-78.6850556,10.8908074
29.4726042,-78.7159049,10.9098247
29.2755014,-78.7496159,10.9278319
29.0789013,-78.7861872,10.9448807
28.8828631,-78.8256107,10.9610618
28.6874159,-78.8678774,10.9768167
28.4925952,-78.9129718,10.9924093
28.2984533,-78.9608711,11.0079811
28.1050191,-79.0115578,11.0235051
27.9123255,-79.0650153,11.0388705
27.7204239,-79.1212228,11.0540017
27.5293437,-79.1801659,11.0688532
27.3391175,-79.2418300,11.0833897
27.1497957,-79.3061950,11.0975780
26.9614081,-79.3732479,11.1113664
26.7739877,-79.4429757,11.1247227
26.5875839,-79.5153590,11.1376192
26.4022275,-79.5903859,11.1500238
26.2179520,-79.6680440,11.1619104
26.0348060,-79.7483146,11.1732566
25.8528215,-79.8311864,11.1840372
25.6720329,-79.9166473,11.1942345
25.4924880,-80.0046792,11.2038316
25.3142202,-80.0952706,11.2128093
25.1372654,-80.1884095,11.2211469
24.9616704,-80.2840781,11.2288326
24.7874700,-80.3822646,11.2358786
24.6147019,-80.4829561,11.2422544
24.4434121,-80.5861359,11.2479177
24.2736384,-80.6917930,11.2527500
24.1054194,-80.7999114,11.2570555
23.9387944,-80.9104671,11.2610744
23.7737947,-81.0234351,11.2653036
23.6104651,-81.1388057,11.2683111
23.4488635,-81.2565835,11.2692140
23.2890514,-81.3767796,11.2671140
23.1310571,-81.4993531,11.2662495
22.9748732,-81.6242275,11.2689363
22.8204810,-81.7513112,11.2764621
22.6678683,-81.8805212,11.2876914
22.5170249,-82.0117972,11.3016605
22.3679627,-82.1450922,11.3165276
22.2206995,-82.2803678,11.3317658
22.0752479,-82.4175940,11.3471726
21.9316228,-82.5567314,11.3630988
21.7898362,-82.6977364,11.3797794
21.6498874,-82.8405710,11.3973774
21.5117790,-82.9851867,11.4162066
21.3755104,-83.1315302,11.4365121
21.2410664,-83.2795585,11.4583988
21.1084400,-83.4292183,11.4818997
20.9776247,-83.5804553,11.5069216
20.8486006,-83.7332312,11.5333967
20.7213581,-83.8874948,11.5612981
20.5958877,-84.0431942,11.5905953
20.4721655,-84.2002946,11.6212509
20.3501789,-84.3587473,11.6532229
20.2299156,-84.5185029,11.6864723
20.1113493,-84.6795299,11.7209624
19.9944647,-84.8417827,11.7566577
19.8792470,-85.0052149,11.7935197
19.7656685,-85.1697977,11.8315140
19.6537117,-85.3354889,11.8706035
19.5433594,-85.5022455,11.9107519
19.4345836,-85.6700408,11.9518992
19.3273648,-85.8388363,11.9925769
19.2216838,-86.0085926,12.0327925
19.1175131,-86.1792846,12.0725532
19.0148315,-86.3508773,12.1118661
18.9136181,-86.5233356,12.1507380
18.8138461,-86.6966352,12.1891757
18.7154935,-86.8707445,12.2271857
18.6185378,-87.0456331,12.2647745
18.5229536,-87.2212769,12.3019484
18.4287182,-87.3976477,12.3387135
18.3358079,-87.5747197,12.3750758
18.2441989,-87.7524692,12.4110412
18.1538683,-87.9308704,12.4466154
18.0647917,-88.1099028,12.4818042
17.9769465,-88.2895423,12.5166131
17.8903107,-88.4697657,12.5510474
17.8048588,-88.6505572,12.5851124
17.7205700,-88.8318929,12.6188134
17.6374228,-89.0137511,12.6521554
17.5553914,-89.1961210,12.6851434
17.4744565,-89.3789788,12.7177823
17.3945976,-89.5623039,12.7500769
17.3157884,-89.7460899,12.7820318
17.2380103,-89.9303130,12.8136518
17.1612452,-90.1149537,12.8449412
17.0854703,-90.3000121,12.8759046
17.0106755,-90.4854673,12.9065463
16.9368519,-90.6713035,12.9368705
16.8639831,-90.8575262,12.9668814
16.7920632,-91.0441153,12.9965832
16.7210841,-91.2310571,13.0259798
16.6510312,-91.4183572,13.0550753
16.5818997,-91.6059973,13.0838735
16.5136817,-91.7939655,13.1123783
16.4463611,-91.9822643,13.1405933
16.3799261,-92.1708757,13.1685223
16.3143593,-92.3597858,13.1961690
16.2496378,-92.5489929,13.2235368
16.1857435,-92.7384797,13.2506293
16.1226572,-92.9282333,13.2774498
16.0603567,-93.1182508,13.3040019
15.9988238,-93.3085173,13.3302887
15.9380390,-93.4990214,13.3563136
15.8779804,-93.6897590,13.3820798
15.8186291,-93.8807170,13.4075904
15.7599650,-94.0718855,13.4328485
15.7019663,-94.2632591,13.4578572
15.6446130,-94.4548264,13.4826195
15.5878842,-94.6465787,13.5071384
15.5317578,-94.8385093,13.5314167
15.4762128,-95.0306086,13.5554574
15.4212269,-95.2228683,13.5792632
15.3667779,-95.4152812,13.6028369
15.3128431,-95.6078386,13.6261812
15.2593995,-95.8005331,13.6492989
15.2064237,-95.9933565,13.6721926
15.1538919,-96.1863013,13.6948648
15.1017799,-96.3793604,13.7173182
15.0500635,-96.5725252,13.7395552
14.9987175,-96.7657888,13.7615784
14.9477164,-96.9591445,13.7833902
14.8970352,-97.1525834,13.8049930
14.8466475,-97.3460990,13.8263893
14.7965268,-97.5396848,13.8475812
14.7466469,-97.7333318,13.8685712
14.6969806,-97.9270338,13.8893615
14.6475003,-98.1207842,13.9099544
14.5981791,-98.3145742,13.9303520
14.5489886,-98.5083976,13.9505566
14.4999009,-98.7022479,13.9705703
14.4508879,-98.8961161,13.9903951
14.4019209,-99.0899961,14.0100333
14.3529712,-99.2838811,14.0294868
14.3040102,-99.4777625,14.0487576
14.2550087,-99.6716338,14.0678479
14.2059377,-99.8654880,14.0867594
14.1567681,-100.0593167,14.1054943
14.1074707,-100.2531130,14.1240543
14.0580160,-100.4468696,14.1424414
14.0083750,-100.6405781,14.1606575
13.9585183,-100.8342314,14.1787043
13.9084165,-101.0278215,14.1965837
13.8580406,-101.2213403,14.2142975
13.8073612,-101.4147799,14.2318475
13.7563494,-101.6081321,14.2492354
13.7049762,-101.8013886,14.2664628
13.6532126,-101.9945410,14.2835316
13.6010301,-102.1875803,14.3004434
13.5483999,-102.3804984,14.3171997
13.4952937,-102.5732860,14.3338024
13.4416835,-102.7659336,14.3502529
13.3875410,-102.9584328,14.3665528
13.3328386,-103.1507735,14.3827038
13.2775487,-103.3429458,14.3987074
13.2216440,-103.5349406,14.4145650
13.1650974,-103.7267473,14.4302782
13.1078821,-103.9183551,14.4458486
13.0499715,-104.1097544,14.4612775
12.9913395,-104.3009339,14.4765664
12.9319599,-104.4918821,14.4917167
12.8718063,-104.6825884,14.3511345
12.8108543,-104.8730408,14.1872553
12.7490804,-105.0632280,14.0236244
12.6864559,-105.2531372,13.8601498
12.6229517,-105.4427538,13.6964941
12.5585495,-105.6320673,13.5308643
12.4932859,-105.8210853,13.3598081
12.4272212,-106.0098251,13.1821126
12.3604032,-106.1982975,13.0022557
12.2927790,-106.3864838,12.8270732
12.2242417,-106.5743406,12.6581688
12.1546641,-106.7618099,12.4951292
12.0839152,-106.9488452,12.3377410
12.0118706,-107.1353856,12.1858715
11.9384072,-107.3213657,12.0392607
11.8633980,-107.5067341,11.8976446
11.7867261,-107.6914207,11.7606881
11.7082789,-107.8753537,11.6280623
11.6279414,-108.0584760,11.4995226
11.5456103,-108.2407098,11.3747806
11.4611864,-108.4219774,11.2534895
11.3745687,-108.6022140,11.1354101
11.2856695,-108.7813348,11.0202523
11.1944046,-108.9592571,10.9076845
11.1006898,-109.1359071,10.7974850
11.0044535,-109.3111943,10.6893767
10.9056271,-109.4850318,10.5830525
10.8041445,-109.6573356,10.4783218
10.6999499,-109.8280111,10.3749516
10.5929888,-109.9969675,10.2726739
10.4832142,-110.1641089,10.1713090
10.3705837,-110.3293378,10.0706207
10.2550569,-110.4925593,9.9705228
10.1366041,-110.6536644,9.8710247
10.0151900,-110.8125493,9.7722307
9.8907788,-110.9691062,9.6742030
9.7633490,-111.1232055,9.5769258
9.6328674,-111.2747312,9.4803452
9.4993069,-111.4235593,9.3844261
9.3626596,-111.5695449,9.2891604
9.2229021,-111.7125589,9.1945761
9.0800198,-111.8524604,9.1007514
8.9340169,-111.9890873,9.0077446
8.7848807,-112.1222914,8.9156712
8.6326105,-112.2519085,8.8246977
8.4772216,-112.3777572,8.7349599
8.3187164,-112.4996622,8.6466940
8.1571118,-112.6174311,8.5601144
7.9924365,-112.7308586,8.4753584
7.8247173,-112.8397384,8.3925958
7.6539979,-112.9438498,8.3123507
7.4803279,-113.0429600,8.2349894
7.3037664,-113.1368233,8.1609791
7.1243889,-113.2251822,8.0897678
6.9422888,-113.3077869,8.0207696
6.7575890,-113.3844015,7.9526864
6.5704417,-113.4548107,7.8861270
6.3809952,-113.5187953,7.8250747
6.1894009,-113.5760229,7.7789683
5.9957842,-113.6259917,7.7462481
5.8003360,-113.6682255,7.7153708
5.6033575,-113.7026056,7.6843694
5.4052182,-113.7296058,7.6790150
5.2062812,-113.7497131,7.6942620
5.0067919,-113.7633782,7.7265945
4.8069751,-113.7709988,7.7721798
4.6070312,-113.7729637,7.8296625
4.4070969,-113.7696453,7.8976736
4.2073153,-113.7613864,7.9743909
4.0077670,-113.7484969,8.0579934
3.8085435,-113.7312589,8.1473660
3.6097331,-113.7099243,8.2410984
3.4113545,-113.6847041,8.3361067
3.2134855,-113.6557922,8.4292951
3.0161696,-113.6233667,8.5207292
2.8194171,-113.5876148,8.6104707
2.6232627,-113.5487482,8.6985778
2.4277005,-113.5069936,8.7851053
2.2327248,-113.4625871,8.8701050
2.0383159,-113.4157710,8.9536257
1.8444342,-113.3667949,9.0357138
1.6510473,-113.3159286,9.1164134
1.4580897,-113.2634509,9.1957660
1.2654912,-113.2096571,9.2738114
1.0731812,-113.1548589,9.3505873
0.8810655,-113.0993745,9.4261296
0.6890527,-113.0435345,9.5004726
0.4970460,-112.9876759,9.5736491
0.3049447,-112.9321388,9.6456901
0.1126549,-112.8772680,9.7166257
-0.0799226,-112.8234046,9.7864844
-0.2728722,-112.7708896,9.8552936
-0.4662681,-112.7200610,9.9230795
-0.6601885,-112.6712500,9.7827895
-0.8546826,-112.6247824,9.6272743
-1.0497855,-112.5809637,9.4788825
-1.2455278,-112.5400631,9.3364054
-1.4419026,-112.5023300,9.1985831
-1.6388995,-112.4679949,9.0652756
-1.8364961,-112.4372894,8.9364358
-2.0346517,-112.4104509,8.8121447
-2.2333252,-112.3877213,8.6925242
-2.4324426,-112.3693511,8.5777051
-2.6319313,-112.3555954,8.4679678
-2.8317026,-112.3467185,8.3638959
-3.0316264,-112.3429970,8.2658095
-3.2315793,-112.3447137,8.1740581
-3.4314042,-112.3521562,8.0892591
-3.6309066,-112.3656177,8.0119896
-3.8298845,-112.3853973,7.9430522
-4.0280899,-112.4117968,7.8833894
-4.2252530,-112.4451226,7.8354092
-4.4210461,-112.4857180,7.8041765
-4.6151091,-112.5339384,7.7728183
-4.8071386,-112.5896937,7.7469507
-4.9969145,-112.6526777,7.7321262
-5.1842840,-112.7225644,7.7288145
-5.3690481,-112.7990026,7.7358127
-5.5511154,-112.8816634,7.7524871
-5.7304313,-112.9702101,7.7790814
-5.9068673,-113.0642768,7.8140980
-6.0804229,-113.1635687,7.8565631
-6.2510984,-113.2678015,7.9056870
-6.4188183,-113.3766494,7.9606761
-6.5836271,-113.4898674,8.0209088
-6.7455555,-113.6072164,8.0857153
-6.9045767,-113.7284250,8.1543942
-7.0607490,-113.8532933,8.2265185
-7.2141089,-113.9816184,8.3016081
-7.3646739,-114.1131929,8.3790750
-7.5125006,-114.2478526,8.4586311
-7.6576117,-114.3854148,8.5399359
-7.8000649,-114.5257401,8.6225299
-7.9399097,-114.6686921,8.7062452
-8.0771464,-114.8140916,8.7908793
-8.2118654,-114.9618640,8.8757777
-8.3441069,-115.1118970,8.9592005
-8.4738434,-115.2640133,9.0411938
-8.6011757,-115.4182031,9.1218013
-8.7261226,-115.5743737,9.2010646
-8.8486438,-115.7323601,9.2790233
-8.9688404,-115.8921791,9.3557150
-9.0867276,-116.0537420,9.4311755
-9.2022816,-116.2169037,9.5054389
-9.3155926,-116.3816779,9.5785378
-9.4266794,-116.5479789,9.6505035
-9.5355458,-116.7156913,9.7213656
-9.6422688,-116.8848063,9.7911528
-9.7468806,-117.0552417,9.8598922
-9.8494170,-117.2269107,9.9276101
-9.9499489,-117.3997756,9.9943316
-10.0485283,-117.5737595,10.0600808
-10.1452183,-117.7487980,10.1248808
-10.2400878,-117.9248317,10.1887539
-10.3332049,-118.1017922,10.2517216
-10.4246530,-118.2796312,10.3138045
-10.5145080,-118.4582741,10.3750224
-10.6028579,-118.6376594,10.4353945
-10.6898045,-118.8177440,10.4949394
-10.7754366,-118.9984480,10.5536747
-10.8598579,-119.1797147,10.6116178
-10.9431831,-119.3615033,10.6687853
-11.0255125,-119.5437353,10.7251932
-11.1069606,-119.7263579,10.7808571
-11.1876496,-119.9093309,10.8357921
-11.2676888,-120.0925803,10.8900127
-11.3471990,-120.2760562,10.9435331
-11.4263061,-120.4597171,10.9963668
-11.5051251,-120.6434948,11.0485272
-11.5837801,-120.8273404,11.1000271
-11.6623975,-121.0112097,11.1508790
-11.7410960,-121.1950393,11.2010949
-11.8200001,-121.3787796,11.2506867
-11.8992349,-121.5623818,11.2996657
-11.9789207,-121.7457859,11.3480430
-12.0591806,-121.9289395,11.3958294
-12.1401367,-122.1117874,11.4430354
-12.2219104,-122.2942706,11.4896712
-12.3046220,-122.4763313,11.5357467
-12.3883870,-122.6579085,11.5812716
-12.4733144,-122.8389453,11.6262552
-12.5595083,-123.0193841,11.6707067
-12.6470671,-123.1991611,11.7146351
-12.7360928,-123.3782183,11.7580490
-12.8266843,-123.5564904,11.7394990
-12.9189357,-123.7339046,11.6021759
-13.0129455,-123.9103963,11.4682863
-13.1088059,-124.0858911,11.3376411
-13.2066056,-124.2603086,11.2105223
-13.3064407,-124.4335719,11.0872223
-13.4084079,-124.6055888,10.9681187
-13.5126076,-124.7762621,10.8525259
-13.6191320,-124.9454949,10.7400645
-13.7280615,-125.1131864,10.6303324
-13.8394735,-125.2792456,10.5224268
-13.9534235,-125.4435705,10.4149946
-14.0699441,-125.6060737,10.3064434
-14.1890593,-125.7667029,10.1967113
-14.3107607,-125.9253695,10.0856531
-14.4350633,-126.0819958,9.9744338
-14.5620119,-126.2365074,9.8644738
-14.6916320,-126.3887695,9.7565736
-14.8239846,-126.5386575,9.6516492
-14.9591455,-126.6860333,9.5498986
-15.0971655,-126.8307253,9.4511330
-15.2381022,-126.9725746,9.3551314
-15.3820070,-127.1114210,9.2619301
-15.5289107,-127.2470843,9.1715244
-15.6788459,-127.3793877,9.0839305
-15.8318370,-127.5081499,8.9986066
-15.9878868,-127.6331835,8.9155139
-16.1469936,-127.7543034,8.8346421
-16.3091434,-127.8713167,8.7561740
-16.4743144,-127.9840238,8.6802018
-16.6424783,-128.0922211,8.6068375
-16.8135836,-128.1956895,8.5366442
-16.9875876,-128.2942094,8.4696262
-17.1644314,-128.3875550,8.4057814
-17.3440149,-128.4754749,8.3480676
-17.5262857,-128.5576985,8.2957327
-17.7111470,-128.6339519,8.2479228
-17.8984354,-128.7039607,8.2069445
-18.0880459,-128.7674483,8.1711030
-18.2798072,-128.8241614,8.1385322
-18.4734618,-128.8739156,8.1058305
-18.6687949,-128.9166854,8.0779855
-18.8655221,-128.9525476,8.0578222
-19.0633415,-128.9816679,8.0480294
-19.2620256,-129.0042339,8.0478476
-19.4613349,-129.0204266,8.0560349
-19.6610407,-129.0304235,8.0715018
-19.8609632,-129.0343998,8.0932374
-20.0609195,-129.0325241,8.1204012
-20.2607352,-129.0249608,8.1522483
-20.4602692,-129.0118718,8.1882679
-20.6593808,-128.9934191,8.2280800
-20.8579379,-128.9697643,8.2713659
-21.0558315,-128.9410647,8.3177126
-21.2529545,-128.9074756,8.3668232
-21.4492109,-128.8691499,8.4184421
-21.6445170,-128.8262379,8.4723839
-21.8387928,-128.7788852,8.5283147
-22.0319720,-128.7272298,8.5859119
-22.2239886,-128.6714111,8.6451606
-22.4147872,-128.6115708,8.7061710
-22.6043317,-128.5478502,8.7690933
-22.7925766,-128.4803959,8.8339659
-22.9794917,-128.4093513,8.9007848
-23.1650675,-128.3348544,8.9695691
-23.3492772,-128.2570530,9.0404601
-23.5321145,-128.1760898,9.1135072
-23.7135930,-128.0921012,9.1887815
-23.8937061,-128.0052361,9.2664353
-24.0724698,-127.9156356,9.3433305
-24.2499171,-127.8234348,9.4189888
-24.4260619,-127.7287811,9.4934446
-24.6009401,-127.6318130,9.5667307
-24.7745995,-127.5326640,9.6388786
-24.9470737,-127.4314762,9.7099182
-25.1184158,-127.3283841,9.7798782
-25.2886806,-127.2235170,9.8487862
-25.4579048,-127.1169814,9.9166684
-25.6261026,-127.0088311,9.9835503
-25.7932587,-126.8990782,10.0494559
-25.9593685,-126.7877475,10.1144087
-26.1244168,-126.6748484,10.1784311
-26.2883701,-126.5603668,10.2415445
-26.4511899,-126.4442779,10.3037699
-26.6128362,-126.3265589,10.3651271
-26.7732674,-126.2071923,10.4256355
-26.9324458,-126.0861584,10.4853136
-27.0903303,-125.9634402,10.5441794
-27.2468774,-125.8390234,10.6022502
-27.4020476,-125.7128918,10.6595426
-27.5557981,-125.5850325,10.7160730
-27.7080842,-125.4554351,10.7718568
-27.8588645,-125.3240873,10.8269045
-28.0080944,-125.1909800,10.8780332
-28.1557280,-125.0561063,10.9253808
-28.3017216,-124.9194580,10.9690946
-28.4460288,-124.7810296,11.0092945
-28.5886024,-124.6408175,11.0460961
-28.7293960,-124.4988174,11.0796204
-28.8683611,-124.3550275,11.1099666
-29.0054490,-124.2094471,11.1372303
-29.1406102,-124.0620760,11.1615083
-29.2737940,-123.9129159,11.1828821
-29.4049496,-123.7619687,11.2014298
-29.5340242,-123.6092387,11.2172267
-29.6609645,-123.4547309,11.2303390
-29.7857170,-123.2984501,11.2408301
-29.9082256,-123.1404049,11.2487565
-30.0284336,-122.9806037,11.2541723
-30.1462847,-122.8190549,11.2571283
-30.2617187,-122.6557713,11.2576667
-30.3746758,-122.4907654,11.2558333
-30.4850960,-122.3240492,11.2516706
-30.5929153,-122.1556406,11.2452190
-30.6980704,-121.9855566,11.2365243
-30.8004978,-121.8138141,11.2256295
-30.9001306,-121.6404368,11.2126169
-30.9969029,-121.4654477,11.1975497
-31.0907495,-121.2888703,11.1804903
-31.1816031,-121.1107359,11.1616344
-31.2694000,-120.9310758,11.1411452
-31.3540750,-120.7499220,11.1191980
-31.4355474,-120.5673064,11.0945846
-31.5137585,-120.3832708,11.0689054
-31.5886873,-120.1978740,11.0440741
-31.6603523,-120.0111924,11.0233684
-31.7287654,-119.8232929,11.0054836
-31.7939121,-119.6342393,10.9887665
-31.8557768,-119.4440843,10.9727783
-31.9143590,-119.2528894,10.9584540
-31.9696761,-119.0607305,10.9469112
-32.0217529,-118.8676646,10.9380059
-32.0706116,-118.6737561,10.9315750
-32.1162732,-118.4790769,10.9274629
-32.1587633,-118.2836768,10.9255130
-32.1981045,-118.0876155,10.9255412
-32.2343169,-117.8909589,10.9273641
-32.2674238,-117.6937516,10.9307916
-32.2974455,-117.4960491,10.9356862
-32.3244013,-117.2979103,10.9419158
-32.3483125,-117.0993778,10.9493541
-32.3691982,-116.9005036,10.9578905
-32.3870773,-116.7013388,10.9674169
-32.4019678,-116.5019267,10.9777564
-32.4138894,-116.3023158,10.9889606
-32.4228662,-116.1025500,11.0011188
-32.4289291,-115.9026748,11.0147078
-32.4321112,-115.7027347,11.0296618
-32.4324457,-115.5027660,11.0458865
-32.4299677,-115.3028143,11.0634578
-32.4247138,-115.1029191,11.0823560
-32.4167214,-114.9031084,11.1025700
-32.4060301,-114.7034276,11.1241352
-32.3926802,-114.5039104,11.1470375
-32.3767124,-114.3045773,11.1712740
-32.3581703,-114.1054722,11.1968798
-32.3370979,-113.9066230,11.2238429
-32.3135381,-113.7080433,11.2521620
-32.2875387,-113.5097743,11.2818690
-32.2591459,-113.3118379,11.3129539
-32.2284051,-113.1142422,11.3454161
-32.1953670,-112.9170240,11.3792880
-32.1600799,-112.7201996,11.4145470
-32.1225905,-112.5237730,11.4511753
-32.0829520,-112.3277750,11.4892600
-32.0412137,-112.1322161,11.5287187
-31.9974197,-111.9371000,11.5694542
-31.9516081,-111.7424525,11.6105638
-31.9038090,-111.5482841,11.6519078
-31.8540510,-111.3546049,11.6933808
-31.8023659,-111.1614334,11.7350968
-31.7487834,-110.9687791,11.7770333
-31.6933331,-110.7766540,11.8191549
-31.6360442,-110.5850693,11.8613547
-31.5769448,-110.3940335,11.9030683
-31.5160644,-110.2035610,11.9443034
-31.4534289,-110.0136568,11.9850677
-31.3890637,-109.8243287,12.0253684
-31.3229952,-109.6355944,12.0652130
-31.2552416,-109.4474550,12.1046084
-31.1858225,-109.2599199,12.1435616
-31.1147605,-109.0730092,12.1820793
-31.0420697,-108.8867212,12.2201682
-30.9677679,-108.7010661,12.2578346
-30.8918762,-108.5160637,12.2950850
-30.8144059,-108.3317118,12.3319254
-30.7353731,-108.1480209,12.3683619
-30.6547972,-107.9650095,12.4044005
-30.5726925,-107.7826744,12.4400469
-30.4890861,-107.6010200,12.4753068
-30.4040148,-107.4200542,12.5101857
-30.3174987,-107.2397705,12.5446890
-30.2295569,-107.0601750,12.5788221
-30.1402080,-106.8812822,12.6125903
-30.0494620,-106.7030901,12.6459985
-29.9573330,-106.5256063,12.6790517
-29.8638386,-106.3488444,12.7117550
-29.7689878,-106.1728029,12.7441131
-29.6727944,-105.9974892,12.7761307
-29.5752743,-105.8229153,12.8078124
-29.4764366,-105.6490809,12.8391628
-29.3762941,-105.4759931,12.8701864
-29.2748617,-105.3036623,12.9008874
-29.1721485,-105.1320893,12.9312701
-29.0681669,-104.9612810,12.9613388
-28.9629302,-104.7912458,12.9910976
-28.8564481,-104.6219861,13.0205506
-28.7487327,-104.4535082,13.0497016
-28.6397960,-104.2858186,13.0785547
-28.5296481,-104.1189214,13.1071136
-28.4183017,-103.9528215,13.1353821
-28.3057713,-103.7875215,13.1633639
-28.1920729,-103.6230225,13.1910626
-28.0772232,-103.4593258,13.2184819
-27.9612375,-103.2964310,13.2456252
-27.8441326,-103.1343395,13.2724959
-27.7259247,-102.9730517,13.2990975
-27.6066282,-102.8125650,13.3254333
-27.4862608,-102.6528813,13.3515065
-27.3648384,-102.4939999,13.3773204
-27.2423746,-102.3359164,13.4028782
-27.1188877,-102.1786327,13.4281829
-26.9943935,-102.0221470,13.4532376
-26.8689047,-101.8664534,13.4780454
-26.7424405,-101.7115536,13.5026092
-26.6150163,-101.5574447,13.5269320
-26.4866443,-101.4041192,13.5510165
-26.3573441,-101.2515788,13.5748656
-26.2271312,-101.0998191,13.5984822
-26.0960170,-100.9488316,13.6218689
-25.9640217,-100.7986172,13.6450284
-25.8311605,-100.6491708,13.6679634
-25.6974444,-100.5004824,13.6906765
-25.5628941,-100.3525523,13.7131703
-25.4275243,-100.2053744,13.7354472
-25.2913459,-100.0589376,13.7575099
-25.1543797,-99.9132416,13.7793607
-25.0166404,-99.7682790,13.8010021
-24.8781383,-99.6240379,13.8224365
-24.7388945,-99.4805170,13.8436661
-24.5989235,-99.3377082,13.8646934
-24.4582353,-99.1955985,13.8855206
-24.3168506,-99.0541863,13.9061499
-24.1747831,-98.9134626,13.9265836
-24.0320424,-98.7734151,13.9468238
-23.8886481,-98.6340409,13.9668727
-23.7446137,-98.4953309,13.9867325
-23.5999489,-98.3572721,14.0064051
-23.4546727,-98.2198607,14.0258927
-23.3087983,-98.0830866,14.0451973
-23.1623358,-97.9469369,14.0643208
-23.0153032,-97.8114065,14.0832654
-22.8677136,-97.6764845,14.1020328
-22.7195780,-97.5421581,14.1206252
-22.5709121,-97.4084216,14.1390442
-22.4217246,-97.2752674,14.1572918
-22.2720230,-97.1426898,14.1753699
-22.1218164,-97.0106856,14.1932803
-21.9711121,-96.8792496,14.2110247
-21.8199181,-96.7483773,14.2286049
-21.6682422,-96.6180639,14.2460227
-21.5160914,-96.4883043,14.2632798
-21.3634745,-96.3590949,14.2803778
-21.2103978,-96.2304297,14.2973186
-21.0568681,-96.1023038,14.3141037
-20.9028950,-95.9747144,14.3307347
-20.7484830,-95.8476545,14.3472133
-20.5936391,-95.7211196,14.3635410
-20.4383730,-95.5951072,14.3797195
-20.2826882,-95.4696101,14.3957503
-20.1265913,-95.3446237,14.4116349
-19.9700922,-95.2201462,14.4273748
-19.8131936,-95.0961700,14.4429715
-19.6559016,-94.9726906,14.4584266
-19.4982262,-94.8497067,14.4737413
-19.3401691,-94.7272107,14.4889173
-19.1817364,-94.6051982,14.5039558
-19.0229378,-94.4836682,14.5188584
-18.8637744,-94.3626131,14.5336263
-18.7042519,-94.2420289,14.5482610
-18.5443796,-94.1219147,14.5627637
-18.3841584,-94.0022630,14.5771359
-18.2235937,-93.8830704,14.5913789
-18.0626940,-93.7643356,14.6054939
-17.9014602,-93.6460519,14.6194822
-17.7398975,-93.5282160,14.6333451
-17.5780135,-93.4108264,14.6470839
-17.4158092,-93.2938770,14.6606998
-17.2532896,-93.1773648,14.6741940
-17.0904613,-93.0612879,14.6875677
-16.9273258,-92.9456412,14.7008221
-16.7638877,-92.8304214,14.7139585
-16.6001527,-92.7156265,14.7269779
-16.4361227,-92.6012521,14.7398815
-16.2718020,-92.4872950,14.7526705
-16.1071960,-92.3737521,14.7653460
-15.9423069,-92.2606197,14.7779090
-15.7771409,-92.1478917,14.7903608
-15.6117069,-92.0355583,14.8027024
-15.4460145,-91.9236059,14.8149348
-15.2800745,-91.8120207,14.8270591
-15.1138976,-91.7007889,14.8390765
-14.9474939,-91.5898965,14.8509878
-14.7808736,-91.4793299,14.8627942
-14.6140468,-91.3690751,14.8744966
-14.4470236,-91.2591180,14.8860961
-14.2798139,-91.1494449,14.8975936
-14.1124274,-91.0400416,14.9089902
-13.9448740,-90.9308941,14.9202867
-13.7771633,-90.8219886,14.9314842
-13.6093049,-90.7133108,14.9425836
-13.4413083,-90.6048467,14.9535859
-13.2731830,-90.4965824,14.9644919
-13.1049381,-90.3885037,14.9753026
-12.9365833,-90.2805965,14.9860189
-12.7681277,-90.1728469,14.9966417
-12.5995804,-90.0652405,15.0000000
-12.4309506,-89.9577636,15.0000000
-12.2622475,-89.8504019,15.0000000
-12.0934799,-89.7431412,15.0000000
-11.9246571,-89.6359677,15.0000000
-11.7557880,-89.5288672,15.0000000
-11.5868815,-89.4218256,15.0000000
-11.4179466,-89.3148287,15.0000000
-11.2489923,-89.2078627,15.0000000
-11.0800274,-89.1009132,15.0000000
-10.9110610,-88.9939663,15.0000000
-10.7421018,-88.8870080,15.0000000
-10.5731588,-88.7800239,15.0000000
-10.4042410,-88.6730002,15.0000000
-10.2353573,-88.5659226,15.0000000
-10.0665167,-88.4587772,15.0000000
-9.8977281,-88.3515497,15.0000000
-9.7290006,-88.2442262,15.0000000
-9.5603433,-88.1367925,15.0000000
-9.3917651,-88.0292344,15.0000000
-9.2232755,-87.9215380,15.0000000
-9.0548834,-87.8136888,15.0000000
-8.8865980,-87.7056734,15.0000000
-8.7184290,-87.5974771,15.0000000
-8.5503856,-87.4890849,15.0000000
-8.3824743,-87.3804883,15.0000000
-8.2146991,-87.2716832,15.0000000
-8.0470595,-87.1626665,15.0000000
-7.8795590,-87.0534376,15.0000000
-7.7121998,-86.9439946,15.0000000
-7.5449804,-86.8343334,15.0000000
-7.3779059,-86.7244539,15.0000000
-7.2109787,-86.6143544,15.0000000
-7.0441957,-86.5040295,15.0000000
-6.8775637,-86.3934804,15.0000000
-6.7110848,-86.2827049,15.0000000
-6.5447551,-86.1716972,15.0000000
-6.3785824,-86.0604588,15.0000000
-6.2125688,-85.9489879,15.0000000
-6.0467098,-85.8372779,15.0000000
-5.8810139,-85.7253310,15.0000000
-5.7154826,-85.6131448,15.0000000
-5.5501122,-85.5007134,15.0000000
-5.3849107,-85.3880383,15.0000000
-5.2198796,-85.2751171,15.0000000
-5.0550165,-85.1619447,15.0000000
-4.8903285,-85.0485225,15.0000000
-4.7258199,-84.9348377,15.0000000
-4.5615068,-84.8208725,15.0000000
-4.3974038,-84.7066035,15.0000000
-4.2335266,-84.5920082,15.0000000
-4.0698948,-84.4770679,15.0000000
-3.9065210,-84.3617587,15.0000000
-3.7434209,-84.2460592,15.0000000
-3.5806154,-84.1299520,15.0000000
-3.4181161,-84.0134134,15.0000000
-3.2559392,-83.8964231,15.0000000
-3.0941059,-83.7789647,15.0000000
-2.9326278,-83.6610151,15.0000000
-2.7715215,-83.5425549,15.0000000
-2.6108081,-83.4235686,15.0000000
-2.4504999,-83.3040337,15.0000000
-2.2906139,-83.1839319,15.0000000
-2.1311711,-83.0632479,15.0000000
-1.9721849,-82.9419603,15.0000000
-1.8136726,-82.8200518,15.0000000
-1.6556549,-82.6975071,15.0000000
-1.4981472,-82.5743054,15.0000000
-1.3411659,-82.4504325,15.0000000
-1.1847250,-82.3258806,15.0000000
-1.0288320,-82.2006423,15.0000000
-0.8734960,-82.0747127,15.0000000
-0.7187279,-81.9480881,15.0000000
-0.5645353,-81.8207621,15.0000000
-0.4109278,-81.6927300,15.0000000
-0.2579159,-81.5639883,15.0000000
-0.1055080,-81.4345314,15.0000000
0.0462864,-81.3043551,15.0000000
0.1974569,-81.1734560,15.0000000
0.3479948,-81.0418292,15.0000000
0.4978902,-80.9094710,15.0000000
0.6471330,-80.7763779,15.0000000
0.7957137,-80.6425458,15.0000000
0.9436225,-80.5079716,15.0000000
1.0908505,-80.3726529,15.0000000
1.2373937,-80.2365930,15.0000000
1.3832564,-80.0998037,15.0000000
1.5284492,-79.9623038,15.0000000
1.6729818,-79.8241103,15.0000000
1.8168575,-79.6852320,15.0000000
1.9600704,-79.5456720,15.0000000
2.1026147,-79.4054286,15.0000000
2.2444834,-79.2644998,15.0000000
2.3856662,-79.1228872,15.0000000
2.5261578,-78.9805874,15.0000000
2.6659500,-78.8375979,15.0000000
2.8050292,-78.6939193,15.0000000
2.9433859,-78.5495427,15.0000000
3.0810082,-78.4044633,15.0000000
3.2178816,-78.2586821,15.0000000
3.3539998,-78.1121931,15.0000000
3.4893528,-77.9649941,15.0000000
3.6239266,-77.8170875,15.0000000
3.7577150,-77.6684676,15.0000000
3.8907076,-77.5191326,15.0000000
4.0228906,-77.3690854,15.0000000
4.1542572,-77.2183205,15.0000000
4.2847968,-77.0668369,15.0000000
4.4144960,-76.9146372,15.0000000
4.5433470,-76.7617169,15.0000000
4.6713395,-76.6080754,15.0000000
4.7984612,-76.4537163,15.0000000
4.9247083,-76.2986392,15.0000000
5.0500741,-76.1428472,15.0000000
5.1745501,-75.9863466,15.0000000
5.2981322,-75.8291374,15.0000000
5.4208137,-75.6712233,15.0000000
5.5425867,-75.5126100,15.0000000
5.6634464,-75.3532985,15.0000000
5.7833865,-75.1932925,15.0000000
5.9023991,-75.0325974,15.0000000
6.0204792,-74.8712148,15.0000000
6.1376202,-74.7091488,15.0000000
6.2538149,-74.5464041,15.0000000
6.3690575,-74.3829833,15.0000000
6.4833415,-74.2188903,15.0000000
6.5966600,-74.0541297,15.0000000
6.7090067,-73.8887047,15.0000000
6.8203750,-73.7226194,15.0000000
6.9307582,-73.5558777,15.0000000
7.0401497,-73.3884838,15.0000000
7.1485426,-73.2204419,15.0000000
7.2559307,-73.0517554,15.0000000
7.3623068,-72.8824292,15.0000000
7.4676639,-72.7124677,15.0000000
7.5719960,-72.5418740,15.0000000
7.6752955,-72.3706536,15.0000000
7.7775553,-72.1988110,15.0000000
7.8787696,-72.0263489,15.0000000
7.9789303,-71.8532737,15.0000000
8.0780304,-71.6795900,15.0000000
8.1760640,-71.5053000,15.0000000
8.2730228,-71.3304109,15.0000000
8.3688996,-71.1549276,15.0000000
8.4636887,-70.9788518,15.0000000
8.5573814,-70.8021914,15.0000000
8.6499703,-70.6249515,15.0000000
8.7414500,-70.4471336,15.0000000
8.8318113,-70.2687463,15.0000000
8.9210467,-70.0897948,15.0000000
9.0091509,-69.9102802,15.0000000
9.0961143,-69.7302120,15.0000000
9.1819294,-69.5495956,15.0000000
9.2665908,-69.3684317,15.0000000
9.3500886,-69.1867306,15.0000000
9.4324149,-69.0044977,15.0000000
9.5135640,-68.8217334,15.0000000
9.5935253,-68.6384485,15.0000000
9.6722907,-68.4546486,15.0000000
9.7498542,-68.2703338,15.0000000
9.8262051,-68.0855158,15.0000000
9.9013348,-67.9002003,15.0000000
9.9752368,-67.7143869,15.0000000
10.0478970,-67.5280870,15.0000000
10.1193012,-67.3413047,15.0000000
10.1894377,-67.1540371,15.0000000
10.2582999,-66.9663001,15.0000000
10.3258887,-66.7781040,15.0000000
10.3922094,-66.5894507,15.0000000
10.4572608,-66.4003596,15.0000000
10.5210453,-66.2108408,15.0000000
10.5835679,-66.0208948,15.0000000
10.6448271,-65.8305416,15.0000000
10.7048249,-65.6397900,15.0000000
10.7635657,-65.4486412,15.0000000
10.8210492,-65.2571145,15.0000000
10.8772748,-65.0652162,15.0000000
10.9322358,-64.8729482,15.0000000
10.9859127,-64.6803198,15.0000000
11.0382871,-64.4873334,15.0000000
11.0893420,-64.2939926,15.0000000
11.1390590,-64.1003042,15.0000000
11.1874206,-63.9062724,15.0000000
11.2344088,-63.7119041,15.0000000
11.2800065,-63.5172046,15.0000000
11.3241962,-63.3221797,15.0000000
11.3669601,-63.1268391,15.0000000
11.4082816,-62.9311874,15.0000000
11.4481439,-62.7352317,15.0000000
11.4865292,-62.5389841,15.0000000
11.5234216,-62.3424490,15.0000000
11.5588047,-62.1456351,15.0000000
11.5926613,-61.9485558,15.0000000
11.6249760,-61.7512163,15.0000000
11.6557327,-61.5536265,15.0000000
11.6849149,-61.3558011,15.0000000
11.7125078,-61.1577462,15.0000000
11.7384958,-60.9594729,15.0000000
